BDBM208977 US9233167, 6-O-mPEG3-Nalbuphine
SMILES: COCCOCCOCCO[C@H]1CC[C@@]2(O)[C@H]3Cc4ccc(O)c5OC1[C@]2(CCN3CC1CCC1)c45
InChI Key: InChIKey=MXSQTNCHUNVXKA-PVBHTIBPSA-N
Data: 3 KI  1 IC50  1 EC50
Activity Spreadsheet -- Enzyme Inhibition Constant Data from BindingDB
Found 5 hits for monomerid = 208977
Trg + Lig
Ki
nM
ΔG°
kcal/mole
IC50
nM
Kd
nM
EC50/IC50
nM
koff
s-1
kon
M-1s-1
pHTemp
°C
Mu-type opioid receptor
(Homo sapiens (Human))
BDBM208977
(US9233167, 6-O-mPEG3-Nalbuphine)
Show SMILES COCCOCCOCCO[C@H]1CC[C@@]2(O)[C@H]3Cc4ccc(O)c5OC1[C@]2(CCN3CC1CCC1)c45 |r,TLB:13:14:17.18.35:29.27.28,THB:15:14:17.18.35:29.27.28|
Show InChI InChI=1S/C28H41NO7/c1-32-11-12-33-13-14-34-15-16-35-22-7-8-28(31)23-17-20-5-6-21(30)25-24(20)27(28,26(22)36-25)9-10-29(23)18-19-3-2-4-19/h5-6,19,22-23,26,30-31H,2-4,7-18H2,1H3/t22-,23+,26?,27-,28+/m0/s1
NCI pathway
Reactome pathway
US Patent
27.4n/an/an/an/an/an/an/an/a
Nektar Therapeutics
US Patent
Assay Description
Specific binding is determined by subtraction of the cpm bound in the presence of 50-100× excess of cold ligand. Binding data assays were analyzed us...
US Patent US9233167 (2016)
BindingDB Entry DOI: 10.7270/Q25T3J97
Delta-type opioid receptor
(Homo sapiens (Human))
BDBM208977
(US9233167, 6-O-mPEG3-Nalbuphine)
Show SMILES COCCOCCOCCO[C@H]1CC[C@@]2(O)[C@H]3Cc4ccc(O)c5OC1[C@]2(CCN3CC1CCC1)c45 |r,TLB:13:14:17.18.35:29.27.28,THB:15:14:17.18.35:29.27.28|
Show InChI InChI=1S/C28H41NO7/c1-32-11-12-33-13-14-34-15-16-35-22-7-8-28(31)23-17-20-5-6-21(30)25-24(20)27(28,26(22)36-25)9-10-29(23)18-19-3-2-4-19/h5-6,19,22-23,26,30-31H,2-4,7-18H2,1H3/t22-,23+,26?,27-,28+/m0/s1
Reactome pathway
US Patent
163n/an/an/an/an/an/an/an/a
Nektar Therapeutics
US Patent
Assay Description
Specific binding is determined by subtraction of the cpm bound in the presence of 50-100× excess of cold ligand. Binding data assays were analyzed us...
US Patent US9233167 (2016)
BindingDB Entry DOI: 10.7270/Q25T3J97
Kappa-type opioid receptor
(Homo sapiens (Human))
BDBM208977
(US9233167, 6-O-mPEG3-Nalbuphine)
Show SMILES COCCOCCOCCO[C@H]1CC[C@@]2(O)[C@H]3Cc4ccc(O)c5OC1[C@]2(CCN3CC1CCC1)c45 |r,TLB:13:14:17.18.35:29.27.28,THB:15:14:17.18.35:29.27.28|
Show InChI InChI=1S/C28H41NO7/c1-32-11-12-33-13-14-34-15-16-35-22-7-8-28(31)23-17-20-5-6-21(30)25-24(20)27(28,26(22)36-25)9-10-29(23)18-19-3-2-4-19/h5-6,19,22-23,26,30-31H,2-4,7-18H2,1H3/t22-,23+,26?,27-,28+/m0/s1
Reactome pathway
US Patent
218n/an/an/an/an/an/an/an/a
Nektar Therapeutics
US Patent
Assay Description
Specific binding is determined by subtraction of the cpm bound in the presence of 50-100× excess of cold ligand. Binding data assays were analyzed us...
US Patent US9233167 (2016)
BindingDB Entry DOI: 10.7270/Q25T3J97
Mu-type opioid receptor
(Homo sapiens (Human))
BDBM208977
(US9233167, 6-O-mPEG3-Nalbuphine)
Show SMILES COCCOCCOCCO[C@H]1CC[C@@]2(O)[C@H]3Cc4ccc(O)c5OC1[C@]2(CCN3CC1CCC1)c45 |r,TLB:13:14:17.18.35:29.27.28,THB:15:14:17.18.35:29.27.28|
Show InChI InChI=1S/C28H41NO7/c1-32-11-12-33-13-14-34-15-16-35-22-7-8-28(31)23-17-20-5-6-21(30)25-24(20)27(28,26(22)36-25)9-10-29(23)18-19-3-2-4-19/h5-6,19,22-23,26,30-31H,2-4,7-18H2,1H3/t22-,23+,26?,27-,28+/m0/s1
NCI pathway
Reactome pathway
US Patent
n/an/a 398n/an/an/an/a7.430
Nektar Therapeutics
US Patent
Assay Description
Test compound and/or vehicle was preincubated with the cell membranes and 3 uM GDP in modified HEPES buffer (pH 7.4) for 20 minutes, followed by addi...
US Patent US9233167 (2016)
BindingDB Entry DOI: 10.7270/Q25T3J97
Kappa-type opioid receptor
(Homo sapiens (Human))
BDBM208977
(US9233167, 6-O-mPEG3-Nalbuphine)
Show SMILES COCCOCCOCCO[C@H]1CC[C@@]2(O)[C@H]3Cc4ccc(O)c5OC1[C@]2(CCN3CC1CCC1)c45 |r,TLB:13:14:17.18.35:29.27.28,THB:15:14:17.18.35:29.27.28|
Show InChI InChI=1S/C28H41NO7/c1-32-11-12-33-13-14-34-15-16-35-22-7-8-28(31)23-17-20-5-6-21(30)25-24(20)27(28,26(22)36-25)9-10-29(23)18-19-3-2-4-19/h5-6,19,22-23,26,30-31H,2-4,7-18H2,1H3/t22-,23+,26?,27-,28+/m0/s1
Reactome pathway
US Patent
n/an/an/an/a 26.8n/an/a7.430
Nektar Therapeutics
US Patent
Assay Description
Test compound and/or vehicle was preincubated with the cell membranes and 3 uM GDP in modified HEPES buffer (pH 7.4) for 20 minutes, followed by addi...
US Patent US9233167 (2016)
BindingDB Entry DOI: 10.7270/Q25T3J97