null
SMILES: OC(=O)c1nc(ccc1-c1cnn(Cc2ccccc2)c1)N1CCc2cccc(C(=O)Nc3nc4cccc(Cl)c4s3)c2C1
InChI Key: InChIKey=RZBQGRFSPSOIJX-UHFFFAOYSA-N
Activity Spreadsheet -- Enzyme Inhibition Constant Data from BindingDB
Found 2 hits for monomerid = 209075
Trg + Lig
Ki
nM
ΔG°
kcal/mole
IC50
nM
Kd
nM
EC50/IC50
nM
koff
s-1
kon
M-1s-1
pHTemp
°C
Bcl-2-like protein 1
(Homo sapiens (Human))
BDBM209075
(US9266877, 21)
Show SMILES OC(=O)c1nc(ccc1-c1cnn(Cc2ccccc2)c1)N1CCc2cccc(C(=O)Nc3nc4cccc(Cl)c4s3)c2C1
Show InChI InChI=1S/C33H25ClN6O3S/c34-26-10-5-11-27-30(26)44-33(36-27)38-31(41)24-9-4-8-21-14-15-39(19-25(21)24)28-13-12-23(29(37-28)32(42)43)22-16-35-40(18-22)17-20-6-2-1-3-7-20/h1-13,16,18H,14-15,17,19H2,(H,42,43)(H,36,38,41)
NCI pathway
Reactome pathway
US Patent
183 -9.19n/an/an/an/an/an/a25
ABBVIE INC.
US Patent
Assay Description
The measurement of competition of compounds of Formula (I) with F-Bak for a Bcl-2 family protein (Bcl-xL) binding site using a Time Resolved Fluoresc...
US Patent US9266877 (2016)
BindingDB Entry DOI: 10.7270/Q2H41Q7V
Bcl-2-like protein 1
(Mus musculus (Mouse))
BDBM209075
(US9266877, 21)
Show SMILES OC(=O)c1nc(ccc1-c1cnn(Cc2ccccc2)c1)N1CCc2cccc(C(=O)Nc3nc4cccc(Cl)c4s3)c2C1
Show InChI InChI=1S/C33H25ClN6O3S/c34-26-10-5-11-27-30(26)44-33(36-27)38-31(41)24-9-4-8-21-14-15-39(19-25(21)24)28-13-12-23(29(37-28)32(42)43)22-16-35-40(18-22)17-20-6-2-1-3-7-20/h1-13,16,18H,14-15,17,19H2,(H,42,43)(H,36,38,41)
US Patent
n/an/an/an/a>1.00E+3n/an/an/an/a
ABBVIE INC.
US Patent
Assay Description
The efficacy of the compounds of Formula (I) can also be determined in cell-based killing assays using a variety of cell lines and mouse tumor models...
US Patent US9266877 (2016)
BindingDB Entry DOI: 10.7270/Q2H41Q7V