null
SMILES: Cc1c(cnn1Cc1ccccc1F)-c1ccc(nc1C(O)=O)N1CCc2cccc(C(=O)Nc3nc4ccccc4s3)c2C1
InChI Key: InChIKey=XVCDJVSXLWPQPT-UHFFFAOYSA-N
Activity Spreadsheet -- Enzyme Inhibition Constant Data from BindingDB
Found 2 hits for monomerid = 209095
Trg + Lig
Ki
nM
ΔG°
kcal/mole
IC50
nM
Kd
nM
EC50/IC50
nM
koff
s-1
kon
M-1s-1
pHTemp
°C
Bcl-2-like protein 1
(Homo sapiens (Human))
BDBM209095
(US9266877, 41)
Show SMILES Cc1c(cnn1Cc1ccccc1F)-c1ccc(nc1C(O)=O)N1CCc2cccc(C(=O)Nc3nc4ccccc4s3)c2C1
Show InChI InChI=1S/C34H27FN6O3S/c1-20-25(17-36-41(20)18-22-7-2-3-10-27(22)35)23-13-14-30(38-31(23)33(43)44)40-16-15-21-8-6-9-24(26(21)19-40)32(42)39-34-37-28-11-4-5-12-29(28)45-34/h2-14,17H,15-16,18-19H2,1H3,(H,43,44)(H,37,39,42)
NCI pathway
Reactome pathway
US Patent
1 -12.3n/an/an/an/an/an/a25
ABBVIE INC.
US Patent
Assay Description
The measurement of competition of compounds of Formula (I) with F-Bak for a Bcl-2 family protein (Bcl-xL) binding site using a Time Resolved Fluoresc...
US Patent US9266877 (2016)
BindingDB Entry DOI: 10.7270/Q2H41Q7V
Bcl-2-like protein 1
(Mus musculus (Mouse))
BDBM209095
(US9266877, 41)
Show SMILES Cc1c(cnn1Cc1ccccc1F)-c1ccc(nc1C(O)=O)N1CCc2cccc(C(=O)Nc3nc4ccccc4s3)c2C1
Show InChI InChI=1S/C34H27FN6O3S/c1-20-25(17-36-41(20)18-22-7-2-3-10-27(22)35)23-13-14-30(38-31(23)33(43)44)40-16-15-21-8-6-9-24(26(21)19-40)32(42)39-34-37-28-11-4-5-12-29(28)45-34/h2-14,17H,15-16,18-19H2,1H3,(H,43,44)(H,37,39,42)
US Patent
n/an/an/an/a 11n/an/an/an/a
ABBVIE INC.
US Patent
Assay Description
The efficacy of the compounds of Formula (I) can also be determined in cell-based killing assays using a variety of cell lines and mouse tumor models...
US Patent US9266877 (2016)
BindingDB Entry DOI: 10.7270/Q2H41Q7V