BDBM20914 4-{4-[(diethylamino)methyl]phenyl}-N-ethyl-5-(5-ethyl-2,4-dihydroxyphenyl)-1,2-oxazole-3-carboxamide::Isoxazole, 42d::US10413550, Example 41b::US9718793, 41b
SMILES: CCNC(=O)c1noc(c1-c1ccc(CN(CC)CC)cc1)-c1cc(CC)c(O)cc1O
InChI Key: InChIKey=LALDVGOZMSLLOR-UHFFFAOYSA-N
Data: 3 IC50  1 EC50
PDB links: 1 PDB ID contains this monomer as substructures. 1 PDB ID contains inhibitors having a similarity of 90% to this monomer.
Activity Spreadsheet -- Enzyme Inhibition Constant Data from BindingDB
Found 3 hits for monomerid = 20914
Trg + Lig
Ki
nM
ΔG°
kcal/mole
IC50
nM
Kd
nM
EC50/IC50
nM
koff
s-1
kon
M-1s-1
pHTemp
°C
Heat shock protein HSP 90-beta
(Homo sapiens (Human))
BDBM20914
(4-{4-[(diethylamino)methyl]phenyl}-N-ethyl-5-(5-et...)
Show SMILES CCNC(=O)c1noc(c1-c1ccc(CN(CC)CC)cc1)-c1cc(CC)c(O)cc1O
Show InChI InChI=1S/C25H31N3O4/c1-5-17-13-19(21(30)14-20(17)29)24-22(23(27-32-24)25(31)26-6-2)18-11-9-16(10-12-18)15-28(7-3)8-4/h9-14,29-30H,5-8,15H2,1-4H3,(H,26,31)
Reactome pathway
n/an/a 13n/a 41n/an/an/an/a
Vernalis (R&D) Ltd
Assay Description
The assay is based upon displacement of a fluorescently labeled molecule, which binds specifically to the ATP-binding site of full-length human Hsp90...
J Med Chem 51: 196-218 (2008)
Article DOI: 10.1021/jm701018h
BindingDB Entry DOI: 10.7270/Q2JW8C5C
HSP90
(Homo sapiens (Human)-Alligator mississippiensis (A...)
BDBM20914
(4-{4-[(diethylamino)methyl]phenyl}-N-ethyl-5-(5-et...)
Show SMILES CCNC(=O)c1noc(c1-c1ccc(CN(CC)CC)cc1)-c1cc(CC)c(O)cc1O
Show InChI InChI=1S/C25H31N3O4/c1-5-17-13-19(21(30)14-20(17)29)24-22(23(27-32-24)25(31)26-6-2)18-11-9-16(10-12-18)15-28(7-3)8-4/h9-14,29-30H,5-8,15H2,1-4H3,(H,26,31)
Reactome pathway
US Patent
n/an/a<1.00E+4n/an/an/an/an/an/a
The Institute of Cancer Research
US Patent
Assay Description
(1) Greiner 384-well (Greiner 781101) or Costar 384-well flat-bottomed polystyrene multiwell plates (VWR). (2) Assay buffer of (a) 100 mM Tris...
US Patent US10413550 (2019)
BindingDB Entry DOI: 10.7270/Q2C82CP2
Heat shock protein HSP 90-alpha
(Homo sapiens (Human))
BDBM20914
(4-{4-[(diethylamino)methyl]phenyl}-N-ethyl-5-(5-et...)
Show SMILES CCNC(=O)c1noc(c1-c1ccc(CN(CC)CC)cc1)-c1cc(CC)c(O)cc1O
Show InChI InChI=1S/C25H31N3O4/c1-5-17-13-19(21(30)14-20(17)29)24-22(23(27-32-24)25(31)26-6-2)18-11-9-16(10-12-18)15-28(7-3)8-4/h9-14,29-30H,5-8,15H2,1-4H3,(H,26,31)
NCI pathway
Reactome pathway
US Patent
n/an/a<1.00E+4n/an/an/an/an/an/a
Vernalis (R&D) Ltd.; Cancer Research Technology Limited; The Institute of Cancer Research
US Patent
Assay Description
Fluorescence polarization {also known as fluorescence anisotropy} measures the rotation of a fluorescing species in solution, where the larger molecu...
US Patent US9718793 (2017)
BindingDB Entry DOI: 10.7270/Q2SQ92DM