BDBM20917 Isoxazole, 40j::N-ethyl-5-{5-[2-(3-fluorophenyl)ethyl]-2,4-dihydroxyphenyl}-4-[4-(morpholin-4-ylmethyl)phenyl]-1,2-oxazole-3-carboxamide
SMILES: CCNC(=O)c1noc(c1-c1ccc(CN2CCOCC2)cc1)-c1cc(CCc2cccc(F)c2)c(O)cc1O
InChI Key: InChIKey=ZEVCEUSBFMYXLZ-UHFFFAOYSA-N
Data: 1 IC50  1 EC50
Activity Spreadsheet -- Enzyme Inhibition Constant Data from BindingDB
Found 1 hit for monomerid = 20917
Trg + Lig
Ki
nM
ΔG°
kcal/mole
IC50
nM
Kd
nM
EC50/IC50
nM
koff
s-1
kon
M-1s-1
pHTemp
°C
Heat shock protein HSP 90-beta
(Homo sapiens (Human))
BDBM20917
(Isoxazole, 40j | N-ethyl-5-{5-[2-(3-fluorophenyl)e...)
Show SMILES CCNC(=O)c1noc(c1-c1ccc(CN2CCOCC2)cc1)-c1cc(CCc2cccc(F)c2)c(O)cc1O
Show InChI InChI=1S/C31H32FN3O5/c1-2-33-31(38)29-28(22-9-7-21(8-10-22)19-35-12-14-39-15-13-35)30(40-34-29)25-17-23(26(36)18-27(25)37)11-6-20-4-3-5-24(32)16-20/h3-5,7-10,16-18,36-37H,2,6,11-15,19H2,1H3,(H,33,38)
Reactome pathway
n/an/a 26n/a 58n/an/an/an/a
Vernalis (R&D) Ltd
Assay Description
The assay is based upon displacement of a fluorescently labeled molecule, which binds specifically to the ATP-binding site of full-length human Hsp90...
J Med Chem 51: 196-218 (2008)
Article DOI: 10.1021/jm701018h
BindingDB Entry DOI: 10.7270/Q2JW8C5C