BDBM209467 US10328074, Example III-8::US9266891, III-8
SMILES: CNc1nc(cn2c(C)nnc12)-c1nc2cnc(cc2n1Cc1ccccc1)N1CCN(C)CC1
InChI Key: InChIKey=UACQAGADNJRGFK-UHFFFAOYSA-N
Data: 2 IC50
Activity Spreadsheet -- Enzyme Inhibition Constant Data from BindingDB
Found 3 hits for monomerid = 209467
Trg + Lig
Ki
nM
ΔG°
kcal/mole
IC50
nM
Kd
nM
EC50/IC50
nM
koff
s-1
kon
M-1s-1
pHTemp
°C
BRD4-BD1 and Histone H4
(Homo sapiens (Human))
BDBM209467
(US10328074, Example III-8 | US9266891, III-8)
Show SMILES CNc1nc(cn2c(C)nnc12)-c1nc2cnc(cc2n1Cc1ccccc1)N1CCN(C)CC1
Show InChI InChI=1S/C25H28N10/c1-17-30-31-25-23(26-2)28-20(16-34(17)25)24-29-19-14-27-22(33-11-9-32(3)10-12-33)13-21(19)35(24)15-18-7-5-4-6-8-18/h4-8,13-14,16H,9-12,15H2,1-3H3,(H,26,28)
US Patent
n/an/a 9n/an/an/an/an/an/a
Boehringer Ingelheim International GmbH
US Patent
Assay Description
Compounds are diluted in serial dilution 1:5 in assay buffer from 10 mM stock in DMSO (100 uM start concentration) in white OptiPlate-384 (PerkinElme...
US Patent US9266891 (2016)
BindingDB Entry DOI: 10.7270/Q23X85G7
Bromodomain-containing protein 4 (BRD4) (aa 44-168)
(Homo sapiens (Human))
US11077107, Example III-8
(US10328074, Example III-8 | US9266891, III-8)
Show SMILES CNc1nc(cn2c(C)nnc12)-c1nc2cnc(cc2n1Cc1ccccc1)N1CCN(C)CC1
Show InChI InChI=1S/C25H28N10/c1-17-30-31-25-23(26-2)28-20(16-34(17)25)24-29-19-14-27-22(33-11-9-32(3)10-12-33)13-21(19)35(24)15-18-7-5-4-6-8-18/h4-8,13-14,16H,9-12,15H2,1-3H3,(H,26,28)
n/an/a 9n/an/an/an/an/an/a
TBA
Citation and Details
BRD4 BD1 (aa 42-168)
(Homo sapiens (Human))
BDBM209467
(US10328074, Example III-8 | US9266891, III-8)
Show SMILES CNc1nc(cn2c(C)nnc12)-c1nc2cnc(cc2n1Cc1ccccc1)N1CCN(C)CC1
Show InChI InChI=1S/C25H28N10/c1-17-30-31-25-23(26-2)28-20(16-34(17)25)24-29-19-14-27-22(33-11-9-32(3)10-12-33)13-21(19)35(24)15-18-7-5-4-6-8-18/h4-8,13-14,16H,9-12,15H2,1-3H3,(H,26,28)
US Patent
n/an/a 9n/an/an/an/an/an/a
Duquesne University
Assay Description
This assay is used to determine whether the compounds inhibit the interaction between the first (BRD4-BD1) or the second (BRD4-BD2) bromodomain of BR...
Bioorg Med Chem 17: 7324-36 (2009)
BindingDB Entry DOI: 10.7270/Q20Z75M2