BDBM20989 8-[butyl(ethyl)amino]-4-(4-acetyl-2-methylphenyl)-6-methyl-1H,2H,3H,4H-pyrido[2,3-b]pyrazin-2-one::Pyridopyrazinone, 5a
SMILES: CCCCN(CC)c1cc(C)nc2N(CC(=O)Nc12)c1ccc(cc1C)C(C)=O
InChI Key: InChIKey=AITIQURMMRAPNX-UHFFFAOYSA-N
Data: 1 IC50
Activity Spreadsheet -- Enzyme Inhibition Constant Data from BindingDB
Found 1 hit for monomerid = 20989
Trg + Lig
Ki
nM
ΔG°
kcal/mole
IC50
nM
Kd
nM
EC50/IC50
nM
koff
s-1
kon
M-1s-1
pHTemp
°C
Corticotropin-releasing factor receptor 1
(Rattus norvegicus (rat))
BDBM20989
(8-[butyl(ethyl)amino]-4-(4-acetyl-2-methylphenyl)-...)
Show SMILES CCCCN(CC)c1cc(C)nc2N(CC(=O)Nc12)c1ccc(cc1C)C(C)=O
Show InChI InChI=1S/C23H30N4O2/c1-6-8-11-26(7-2)20-13-16(4)24-23-22(20)25-21(29)14-27(23)19-10-9-18(17(5)28)12-15(19)3/h9-10,12-13H,6-8,11,14H2,1-5H3,(H,25,29)
Reactome pathway
n/an/a 5.80n/an/an/an/a7.023
Bristol-Myers Squibb Company
Assay Description
The IC50 values were measured by monitoring the inhibition effects of test compounds on [125I]-o-CRF binding to rat cortex in vitro.
J Med Chem 50: 2269-72 (2007)
Article DOI: 10.1021/jm0611410
BindingDB Entry DOI: 10.7270/Q25Q4TCS