BDBM20996 (2R)-5-[(diaminomethylidene)amino]-N-[(1S)-2-(4-hydroxyphenyl)-1-[(2-phenylethyl)carbamoyl]ethyl]-2-[(2R)-3-{[(4-methoxyphenyl)methyl]sulfanyl}-2-[1-(4-phenylphenyl)acetamido]propanamido]pentanamide::Tripeptide derivative, 3
SMILES: [#6]-[#8]-c1ccc(-[#6]-[#16]-[#6]-[#6@H](-[#7]-[#6](=O)-[#6]-c2ccc(cc2)-c2ccccc2)-[#6](=O)-[#7]-[#6@H](-[#6]-[#6]-[#6]\[#7]=[#6](/[#7])-[#7])-[#6](=O)-[#7]-[#6@@H](-[#6]-c2ccc(-[#8])cc2)-[#6](=O)-[#7]-[#6]-[#6]-c2ccccc2)cc1
InChI Key: InChIKey=LPWZIUAFYHXPCS-PYHIYFCPSA-N
Data: 1 KI
Activity Spreadsheet -- Enzyme Inhibition Constant Data from BindingDB
Found 1 hit for monomerid = 20996
Trg + Lig
Ki
nM
ΔG°
kcal/mole
IC50
nM
Kd
nM
EC50/IC50
nM
koff
s-1
kon
M-1s-1
pHTemp
°C
Procathepsin L
(Homo sapiens (Human))
BDBM20996
((2R)-5-[(diaminomethylidene)amino]-N-[(1S)-2-(4-hy...)
Show SMILES [#6]-[#8]-c1ccc(-[#6]-[#16]-[#6]-[#6@H](-[#7]-[#6](=O)-[#6]-c2ccc(cc2)-c2ccccc2)-[#6](=O)-[#7]-[#6@H](-[#6]-[#6]-[#6]\[#7]=[#6](/[#7])-[#7])-[#6](=O)-[#7]-[#6@@H](-[#6]-c2ccc(-[#8])cc2)-[#6](=O)-[#7]-[#6]-[#6]-c2ccccc2)cc1 |r|
Show InChI InChI=1S/C48H55N7O6S/c1-61-40-24-18-36(19-25-40)31-62-32-43(53-44(57)30-35-14-20-38(21-15-35)37-11-6-3-7-12-37)47(60)54-41(13-8-27-52-48(49)50)46(59)55-42(29-34-16-22-39(56)23-17-34)45(58)51-28-26-33-9-4-2-5-10-33/h2-7,9-12,14-25,41-43,56H,8,13,26-32H2,1H3,(H,51,58)(H,53,57)(H,54,60)(H,55,59)(H4,49,50,52)/t41-,42+,43+/m1/s1
Reactome pathway
112 -9.48n/an/an/an/an/a5.525
National Research Council Canada
Assay Description
Fluorescence was monitored on a SPEX Fluorolog-2 spectrofluorometer with the excitation and emission wavelengths set at 380 and 440 nm, respectively....
J Med Chem 51: 1361-8 (2008)
Article DOI: 10.1021/jm701190v
BindingDB Entry DOI: 10.7270/Q21Z42QB