BDBM20998 (2R)-5-[(diaminomethylidene)amino]-N-[(1S)-2-phenyl-1-[(2-phenylethyl)carbamoyl]ethyl]-2-[(2R)-2-[1-(4-phenylphenyl)acetamido]-3-sulfanylpropanamido]pentanamide::Tripeptide derivative, 6
SMILES: [#7]\[#6](-[#7])=[#7]/[#6]-[#6]-[#6]-[#6@@H](-[#7]-[#6](=O)-[#6@H](-[#6]-[#16])-[#7]-[#6](=O)-[#6]-c1ccc(cc1)-c1ccccc1)-[#6](=O)-[#7]-[#6@@H](-[#6]-c1ccccc1)-[#6](=O)-[#7]-[#6]-[#6]-c1ccccc1
InChI Key: InChIKey=YOVVYZQRMCTYRU-PLJDCMBSSA-N
Data: 1 KI
Activity Spreadsheet -- Enzyme Inhibition Constant Data from BindingDB
Found 1 hit for monomerid = 20998
Trg + Lig
Ki
nM
ΔG°
kcal/mole
IC50
nM
Kd
nM
EC50/IC50
nM
koff
s-1
kon
M-1s-1
pHTemp
°C
Procathepsin L
(Homo sapiens (Human))
BDBM20998
((2R)-5-[(diaminomethylidene)amino]-N-[(1S)-2-pheny...)
Show SMILES [#7]\[#6](-[#7])=[#7]/[#6]-[#6]-[#6]-[#6@@H](-[#7]-[#6](=O)-[#6@H](-[#6]-[#16])-[#7]-[#6](=O)-[#6]-c1ccc(cc1)-c1ccccc1)-[#6](=O)-[#7]-[#6@@H](-[#6]-c1ccccc1)-[#6](=O)-[#7]-[#6]-[#6]-c1ccccc1 |r|
Show InChI InChI=1S/C40H47N7O4S/c41-40(42)44-23-10-17-33(38(50)47-34(25-29-13-6-2-7-14-29)37(49)43-24-22-28-11-4-1-5-12-28)46-39(51)35(27-52)45-36(48)26-30-18-20-32(21-19-30)31-15-8-3-9-16-31/h1-9,11-16,18-21,33-35,52H,10,17,22-27H2,(H,43,49)(H,45,48)(H,46,51)(H,47,50)(H4,41,42,44)/t33-,34+,35+/m1/s1
Reactome pathway
21 -10.5n/an/an/an/an/a5.525
National Research Council Canada
Assay Description
Fluorescence was monitored on a SPEX Fluorolog-2 spectrofluorometer with the excitation and emission wavelengths set at 380 and 440 nm, respectively....
J Med Chem 51: 1361-8 (2008)
Article DOI: 10.1021/jm701190v
BindingDB Entry DOI: 10.7270/Q21Z42QB