BDBM210020 US10576087, Compound 2.26::US9273046, 2.26::US9895376, Compound 2.26
SMILES: Clc1cccc2nc([nH]c12)C1C2Oc3ccc(Oc4ccnc5NC(=O)CCc45)cc3C12
InChI Key:
Data: 6 IC50
Activity Spreadsheet -- Enzyme Inhibition Constant Data from BindingDB
Found 6 hits for monomerid = 210020
Trg + Lig
Ki
nM
ΔG°
kcal/mole
IC50
nM
Kd
nM
EC50/IC50
nM
koff
s-1
kon
M-1s-1
pHTemp
°C
Serine/threonine-protein kinase B-raf
(Homo sapiens (Human))
BDBM210020
(US10576087, Compound 2.26 | US9273046, 2.26 | US98...)
Show SMILES Clc1cccc2nc([nH]c12)C1C2Oc3ccc(Oc4ccnc5NC(=O)CCc45)cc3C12
NCI pathway
Reactome pathway
US Patent
n/an/a 16n/an/an/an/an/a25
BeiGene, LTD.
US Patent
Assay Description
Compounds disclosed herein were tested against B-Raf (V600E) (PV3849, from Invitrogen) or C-Raf (Y340D/Y341D) (PV3805, from Invitrogen) in a time-res...
US Patent US9273046 (2016)
BindingDB Entry DOI: 10.7270/Q28G8JK6
RAF proto-oncogene serine/threonine-protein kinase
(Homo sapiens (Human))
BDBM210020
(US10576087, Compound 2.26 | US9273046, 2.26 | US98...)
Show SMILES Clc1cccc2nc([nH]c12)C1C2Oc3ccc(Oc4ccnc5NC(=O)CCc45)cc3C12
NCI pathway
Reactome pathway
US Patent
n/an/a<0.25n/an/an/an/an/a25
BeiGene, LTD.
US Patent
Assay Description
Compounds disclosed herein were tested against B-Raf (V600E) (PV3849, from Invitrogen) or C-Raf (Y340D/Y341D) (PV3805, from Invitrogen) in a time-res...
US Patent US9273046 (2016)
BindingDB Entry DOI: 10.7270/Q28G8JK6
C-Raf (Y340D/Y341D)
(Homo sapiens (Human))
BDBM210020
(US10576087, Compound 2.26 | US9273046, 2.26 | US98...)
Show SMILES Clc1cccc2nc([nH]c12)C1C2Oc3ccc(Oc4ccnc5NC(=O)CCc45)cc3C12
US Patent
n/an/a<0.25n/an/an/an/an/an/a
BEIGENE, LTD.
US Patent
Assay Description
Compounds disclosed herein were tested against B-Raf (V600E) (PV3849, from Invitrogen) or C-Raf (Y340D/Y341D) (PV3805, from Invitrogen) in a time-res...
US Patent US10576087 (2020)
BindingDB Entry DOI: 10.7270/Q2HM5BVQ
C-RAF (Y340D Y341D)
(Homo sapiens (Human))
BDBM210020
(US10576087, Compound 2.26 | US9273046, 2.26 | US98...)
Show SMILES Clc1cccc2nc([nH]c12)C1C2Oc3ccc(Oc4ccnc5NC(=O)CCc45)cc3C12
US Patent
n/an/a<0.25n/an/an/an/an/an/a
Research Triangle Institute
Assay Description
Compounds disclosed herein were tested against B-Raf (V600E) (PV3849, from Invitrogen) or C-Raf (Y340D/Y341D) (PV3805, from Invitrogen) in a time-res...
J Med Chem 50: 3686-95 (2007)
BindingDB Entry DOI: 10.7270/Q2V40XG6
B-RAF V600E
(Homo sapiens (Human))
BDBM210020
(US10576087, Compound 2.26 | US9273046, 2.26 | US98...)
Show SMILES Clc1cccc2nc([nH]c12)C1C2Oc3ccc(Oc4ccnc5NC(=O)CCc45)cc3C12
US Patent
n/an/a 16n/an/an/an/an/an/a
BEIGENE, LTD.
US Patent
Assay Description
Compounds disclosed herein were tested against B-Raf (V600E) (PV3849, from Invitrogen) or C-Raf (Y340D/Y341D) (PV3805, from Invitrogen) in a time-res...
US Patent US10576087 (2020)
BindingDB Entry DOI: 10.7270/Q2HM5BVQ
B-RAF V600E
(Homo sapiens (Human))
BDBM210020
(US10576087, Compound 2.26 | US9273046, 2.26 | US98...)
Show SMILES Clc1cccc2nc([nH]c12)C1C2Oc3ccc(Oc4ccnc5NC(=O)CCc45)cc3C12
US Patent
n/an/a 16n/an/an/an/an/an/a
Research Triangle Institute
Assay Description
Compounds disclosed herein were tested against B-Raf (V600E) (PV3849, from Invitrogen) or C-Raf (Y340D/Y341D) (PV3805, from Invitrogen) in a time-res...
J Med Chem 50: 3686-95 (2007)
BindingDB Entry DOI: 10.7270/Q2V40XG6