null
SMILES: CCOC(=O)C(CC)(CC)NC(=O)c1ccc(N2CCCC2)c(OCC2CC2)n1
InChI Key: InChIKey=FGRCVJYAIQKCBG-UHFFFAOYSA-N
Activity Spreadsheet -- Enzyme Inhibition Constant Data from BindingDB
Found 2 hits for monomerid = 210598
Trg + Lig
Ki
nM
ΔG°
kcal/mole
IC50
nM
Kd
nM
EC50/IC50
nM
koff
s-1
kon
M-1s-1
pHTemp
°C
Cannabinoid receptor 1
(Homo sapiens (Human))
BDBM210598
(US9290451, 289)
Show SMILES CCOC(=O)C(CC)(CC)NC(=O)c1ccc(N2CCCC2)c(OCC2CC2)n1
Show InChI InChI=1S/C22H33N3O4/c1-4-22(5-2,21(27)28-6-3)24-19(26)17-11-12-18(25-13-7-8-14-25)20(23-17)29-15-16-9-10-16/h11-12,16H,4-10,13-15H2,1-3H3,(H,24,26)
NCI pathway
Reactome pathway
US Patent
n/an/an/an/a 234n/an/an/a37
Hoffmann-La Roche Inc.
US Patent
Assay Description
CHO cells expressing human CB1 or CB2 receptors are seeded 17-24 hours prior to the experiment 50.000 cells per well in a black 96 well plate with fl...
US Patent US9290451 (2016)
BindingDB Entry DOI: 10.7270/Q20Z724J
Cannabinoid receptor 2
(Homo sapiens (Human))
BDBM210598
(US9290451, 289)
Show SMILES CCOC(=O)C(CC)(CC)NC(=O)c1ccc(N2CCCC2)c(OCC2CC2)n1
Show InChI InChI=1S/C22H33N3O4/c1-4-22(5-2,21(27)28-6-3)24-19(26)17-11-12-18(25-13-7-8-14-25)20(23-17)29-15-16-9-10-16/h11-12,16H,4-10,13-15H2,1-3H3,(H,24,26)
Reactome pathway
US Patent
n/an/an/an/a 1.40n/an/an/a37
Hoffmann-La Roche Inc.
US Patent
Assay Description
CHO cells expressing human CB1 or CB2 receptors are seeded 17-24 hours prior to the experiment 50.000 cells per well in a black 96 well plate with fl...
US Patent US9290451 (2016)
BindingDB Entry DOI: 10.7270/Q20Z724J