BDBM210617 US9290451, 303
SMILES: CC(C)C[C@@H](CO)NC(=O)c1ccc(C2CC2)c(OCC(F)(F)F)n1
InChI Key: InChIKey=HEGCRWHXZDDLQX-LBPRGKRZSA-N
Data: 2 EC50
Activity Spreadsheet -- Enzyme Inhibition Constant Data from BindingDB
Found 2 hits for monomerid = 210617
Trg + Lig
Ki
nM
ΔG°
kcal/mole
IC50
nM
Kd
nM
EC50/IC50
nM
koff
s-1
kon
M-1s-1
pHTemp
°C
Cannabinoid receptor 1
(Homo sapiens (Human))
BDBM210617
(US9290451, 303)
Show SMILES CC(C)C[C@@H](CO)NC(=O)c1ccc(C2CC2)c(OCC(F)(F)F)n1 |r|
Show InChI InChI=1S/C17H23F3N2O3/c1-10(2)7-12(8-23)21-15(24)14-6-5-13(11-3-4-11)16(22-14)25-9-17(18,19)20/h5-6,10-12,23H,3-4,7-9H2,1-2H3,(H,21,24)/t12-/m0/s1
NCI pathway
Reactome pathway
US Patent
n/an/an/an/a>1.00E+4n/an/an/a37
Hoffmann-La Roche Inc.
US Patent
Assay Description
CHO cells expressing human CB1 or CB2 receptors are seeded 17-24 hours prior to the experiment 50.000 cells per well in a black 96 well plate with fl...
US Patent US9290451 (2016)
BindingDB Entry DOI: 10.7270/Q20Z724J
Cannabinoid receptor 2
(Homo sapiens (Human))
BDBM210617
(US9290451, 303)
Show SMILES CC(C)C[C@@H](CO)NC(=O)c1ccc(C2CC2)c(OCC(F)(F)F)n1 |r|
Show InChI InChI=1S/C17H23F3N2O3/c1-10(2)7-12(8-23)21-15(24)14-6-5-13(11-3-4-11)16(22-14)25-9-17(18,19)20/h5-6,10-12,23H,3-4,7-9H2,1-2H3,(H,21,24)/t12-/m0/s1
Reactome pathway
US Patent
n/an/an/an/a 38n/an/an/a37
Hoffmann-La Roche Inc.
US Patent
Assay Description
CHO cells expressing human CB1 or CB2 receptors are seeded 17-24 hours prior to the experiment 50.000 cells per well in a black 96 well plate with fl...
US Patent US9290451 (2016)
BindingDB Entry DOI: 10.7270/Q20Z724J