null
SMILES: CC(C)C[C@H](NC(=O)c1ccc(N2CC(F)(F)C2)c(OCC2CC2)n1)C(=O)N1CC(F)(F)C1
InChI Key: InChIKey=VWGHODKZBDHLDF-INIZCTEOSA-N
Activity Spreadsheet -- Enzyme Inhibition Constant Data from BindingDB
Found 2 hits for monomerid = 210632
Trg + Lig
Ki
nM
ΔG°
kcal/mole
IC50
nM
Kd
nM
EC50/IC50
nM
koff
s-1
kon
M-1s-1
pHTemp
°C
Cannabinoid receptor 1
(Homo sapiens (Human))
BDBM210632
(US9290451, 311)
Show SMILES CC(C)C[C@H](NC(=O)c1ccc(N2CC(F)(F)C2)c(OCC2CC2)n1)C(=O)N1CC(F)(F)C1 |r|
Show InChI InChI=1S/C22H28F4N4O3/c1-13(2)7-16(20(32)30-11-22(25,26)12-30)27-18(31)15-5-6-17(29-9-21(23,24)10-29)19(28-15)33-8-14-3-4-14/h5-6,13-14,16H,3-4,7-12H2,1-2H3,(H,27,31)/t16-/m0/s1
NCI pathway
Reactome pathway
US Patent
n/an/an/an/a>1.00E+4n/an/an/a37
Hoffmann-La Roche Inc.
US Patent
Assay Description
CHO cells expressing human CB1 or CB2 receptors are seeded 17-24 hours prior to the experiment 50.000 cells per well in a black 96 well plate with fl...
US Patent US9290451 (2016)
BindingDB Entry DOI: 10.7270/Q20Z724J
Cannabinoid receptor 2
(Homo sapiens (Human))
BDBM210632
(US9290451, 311)
Show SMILES CC(C)C[C@H](NC(=O)c1ccc(N2CC(F)(F)C2)c(OCC2CC2)n1)C(=O)N1CC(F)(F)C1 |r|
Show InChI InChI=1S/C22H28F4N4O3/c1-13(2)7-16(20(32)30-11-22(25,26)12-30)27-18(31)15-5-6-17(29-9-21(23,24)10-29)19(28-15)33-8-14-3-4-14/h5-6,13-14,16H,3-4,7-12H2,1-2H3,(H,27,31)/t16-/m0/s1
Reactome pathway
US Patent
n/an/an/an/a 8.40n/an/an/a37
Hoffmann-La Roche Inc.
US Patent
Assay Description
CHO cells expressing human CB1 or CB2 receptors are seeded 17-24 hours prior to the experiment 50.000 cells per well in a black 96 well plate with fl...
US Patent US9290451 (2016)
BindingDB Entry DOI: 10.7270/Q20Z724J