BDBM210652 US9290451, 322
SMILES: Cc1nc(no1)C(C)(C)NC(=O)c1ccc(N2CC(=O)C2)c(OCC2CC2)n1
InChI Key: InChIKey=GLMWYKNAHRMHIF-UHFFFAOYSA-N
Data: 2 EC50
Activity Spreadsheet -- Enzyme Inhibition Constant Data from BindingDB
Found 2 hits for monomerid = 210652
Trg + Lig
Ki
nM
ΔG°
kcal/mole
IC50
nM
Kd
nM
EC50/IC50
nM
koff
s-1
kon
M-1s-1
pHTemp
°C
Cannabinoid receptor 1
(Homo sapiens (Human))
BDBM210652
(US9290451, 322)
Show SMILES Cc1nc(no1)C(C)(C)NC(=O)c1ccc(N2CC(=O)C2)c(OCC2CC2)n1
Show InChI InChI=1S/C19H23N5O4/c1-11-20-18(23-28-11)19(2,3)22-16(26)14-6-7-15(24-8-13(25)9-24)17(21-14)27-10-12-4-5-12/h6-7,12H,4-5,8-10H2,1-3H3,(H,22,26)
NCI pathway
Reactome pathway
US Patent
n/an/an/an/a>1.00E+4n/an/an/a37
Hoffmann-La Roche Inc.
US Patent
Assay Description
CHO cells expressing human CB1 or CB2 receptors are seeded 17-24 hours prior to the experiment 50.000 cells per well in a black 96 well plate with fl...
US Patent US9290451 (2016)
BindingDB Entry DOI: 10.7270/Q20Z724J
Cannabinoid receptor 2
(Homo sapiens (Human))
BDBM210652
(US9290451, 322)
Show SMILES Cc1nc(no1)C(C)(C)NC(=O)c1ccc(N2CC(=O)C2)c(OCC2CC2)n1
Show InChI InChI=1S/C19H23N5O4/c1-11-20-18(23-28-11)19(2,3)22-16(26)14-6-7-15(24-8-13(25)9-24)17(21-14)27-10-12-4-5-12/h6-7,12H,4-5,8-10H2,1-3H3,(H,22,26)
Reactome pathway
US Patent
n/an/an/an/a 424n/an/an/a37
Hoffmann-La Roche Inc.
US Patent
Assay Description
CHO cells expressing human CB1 or CB2 receptors are seeded 17-24 hours prior to the experiment 50.000 cells per well in a black 96 well plate with fl...
US Patent US9290451 (2016)
BindingDB Entry DOI: 10.7270/Q20Z724J