null
SMILES: Cn1c(noc1=O)C(C)(C)NC(=O)c1ccc(C2CC2)c(OCC2CC2)n1
InChI Key: InChIKey=FXRIMJMZYGJEDQ-UHFFFAOYSA-N
Activity Spreadsheet -- Enzyme Inhibition Constant Data from BindingDB
Found 2 hits for monomerid = 210675
Trg + Lig
Ki
nM
ΔG°
kcal/mole
IC50
nM
Kd
nM
EC50/IC50
nM
koff
s-1
kon
M-1s-1
pHTemp
°C
Cannabinoid receptor 2
(Homo sapiens (Human))
BDBM210675
(US9290451, 338)
Show SMILES Cn1c(noc1=O)C(C)(C)NC(=O)c1ccc(C2CC2)c(OCC2CC2)n1
Show InChI InChI=1S/C19H24N4O4/c1-19(2,17-22-27-18(25)23(17)3)21-15(24)14-9-8-13(12-6-7-12)16(20-14)26-10-11-4-5-11/h8-9,11-12H,4-7,10H2,1-3H3,(H,21,24)
Reactome pathway
US Patent
n/an/an/an/a 534n/an/an/a37
Hoffmann-La Roche Inc.
US Patent
Assay Description
CHO cells expressing human CB1 or CB2 receptors are seeded 17-24 hours prior to the experiment 50.000 cells per well in a black 96 well plate with fl...
US Patent US9290451 (2016)
BindingDB Entry DOI: 10.7270/Q20Z724J
Cannabinoid receptor 1
(Homo sapiens (Human))
BDBM210675
(US9290451, 338)
Show SMILES Cn1c(noc1=O)C(C)(C)NC(=O)c1ccc(C2CC2)c(OCC2CC2)n1
Show InChI InChI=1S/C19H24N4O4/c1-19(2,17-22-27-18(25)23(17)3)21-15(24)14-9-8-13(12-6-7-12)16(20-14)26-10-11-4-5-11/h8-9,11-12H,4-7,10H2,1-3H3,(H,21,24)
NCI pathway
Reactome pathway
US Patent
n/an/an/an/a>1.00E+4n/an/an/a37
Hoffmann-La Roche Inc.
US Patent
Assay Description
CHO cells expressing human CB1 or CB2 receptors are seeded 17-24 hours prior to the experiment 50.000 cells per well in a black 96 well plate with fl...
US Patent US9290451 (2016)
BindingDB Entry DOI: 10.7270/Q20Z724J