null
SMILES: C[C@@H]1CN(CCN1C(=O)Nc1nc2ccc(Cl)cc2s1)c1ncc(cc1F)[C@@H](O)CO
InChI Key: InChIKey=IDHWTEVUUGOISB-BZNIZROVSA-N
Activity Spreadsheet -- Enzyme Inhibition Constant Data from BindingDB
Found 2 hits for monomerid = 210894
Trg + Lig
Ki
nM
ΔG°
kcal/mole
IC50
nM
Kd
nM
EC50/IC50
nM
koff
s-1
kon
M-1s-1
pHTemp
°C
Transient receptor potential cation channel subfamily V member 1
(Homo sapiens (Human))
BDBM210894
(US9273043, A123(e))
Show SMILES C[C@@H]1CN(CCN1C(=O)Nc1nc2ccc(Cl)cc2s1)c1ncc(cc1F)[C@@H](O)CO |r|
Show InChI InChI=1S/C20H21ClFN5O3S/c1-11-9-26(18-14(22)6-12(8-23-18)16(29)10-28)4-5-27(11)20(30)25-19-24-15-3-2-13(21)7-17(15)31-19/h2-3,6-8,11,16,28-29H,4-5,9-10H2,1H3,(H,24,25,30)/t11-,16+/m1/s1
Reactome pathway
US Patent
n/an/a 0.400n/an/an/an/a7.237
Purdue Pharma L.P.; Shionogi & Co., Ltd.
US Patent
Assay Description
pH dependent Ca2+ responses in TRPV1/CHO cells cultured in a 96-well plate were determined (see, e.g., FIG. 2 of U.S. Patent Application Publication ...
US Patent US9273043 (2016)
BindingDB Entry DOI: 10.7270/Q2D7998G
Transient receptor potential cation channel subfamily V member 1
(Homo sapiens (Human))
BDBM210894
(US9273043, A123(e))
Show SMILES C[C@@H]1CN(CCN1C(=O)Nc1nc2ccc(Cl)cc2s1)c1ncc(cc1F)[C@@H](O)CO |r|
Show InChI InChI=1S/C20H21ClFN5O3S/c1-11-9-26(18-14(22)6-12(8-23-18)16(29)10-28)4-5-27(11)20(30)25-19-24-15-3-2-13(21)7-17(15)31-19/h2-3,6-8,11,16,28-29H,4-5,9-10H2,1H3,(H,24,25,30)/t11-,16+/m1/s1
Reactome pathway
US Patent
n/an/a 11.5n/an/an/an/a7.4n/a
Purdue Pharma L.P.; Shionogi & Co., Ltd.
US Patent
Assay Description
One day prior to assay, TRPV1/CHO cells were seeded in 96-well clear-bottom black plates (20,000 cells/well) in growth media. On the day of the exper...
US Patent US9273043 (2016)
BindingDB Entry DOI: 10.7270/Q2D7998G