BDBM210952 4-(2-(3-chlorobenzyl)-1H-pyrrol-1-yl)-2-(((1r,4r)-4-hydroxycyclohexyl)amino)benzamide (8c)::US10975030, Compound 8c
SMILES: NC(=O)c1ccc(cc1NC1CCC(O)CC1)-n1cccc1Cc1cccc(Cl)c1
InChI Key: InChIKey=OTOOLKPIGBHZQW-UHFFFAOYSA-N
Data: 3 Kd
Activity Spreadsheet -- Enzyme Inhibition Constant Data from BindingDB
Found 3 hits for monomerid = 210952
Trg + Lig
Ki
nM
ΔG°
kcal/mole
IC50
nM
Kd
nM
EC50/IC50
nM
koff
s-1
kon
M-1s-1
pHTemp
°C
Endoplasmin
(Homo sapiens (Human))
BDBM210952
(4-(2-(3-chlorobenzyl)-1H-pyrrol-1-yl)-2-(((1r,4r)-...)
Show SMILES NC(=O)c1ccc(cc1NC1CCC(O)CC1)-n1cccc1Cc1cccc(Cl)c1 |(2.47,4.51,;3.8,3.74,;5.14,4.51,;3.8,2.2,;2.47,1.43,;2.47,-.11,;3.8,-.88,;5.14,-.11,;5.14,1.43,;6.47,2.2,;7.8,1.43,;9.14,2.2,;10.47,1.43,;10.47,-.11,;11.8,-.88,;9.14,-.88,;7.8,-.11,;3.8,-2.42,;2.56,-3.33,;3.03,-4.79,;4.57,-4.79,;5.05,-3.33,;6.51,-2.85,;7.66,-3.88,;7.34,-5.39,;8.48,-6.42,;9.95,-5.95,;10.27,-4.44,;11.73,-3.96,;9.12,-3.41,)|
Show InChI InChI=1S/C24H26ClN3O2/c25-17-4-1-3-16(13-17)14-19-5-2-12-28(19)20-8-11-22(24(26)30)23(15-20)27-18-6-9-21(29)10-7-18/h1-5,8,11-13,15,18,21,27,29H,6-7,9-10,14H2,(H2,26,30)
n/an/an/a 2.45E+3n/an/an/a7.3n/a
The University of Kansas
Assay Description
Assay buffer (25 μL, 20 mM HEPES at pH 7.3, 50 mM KCl, 5 mM MgCl2, 1 mM DTT, 20 mM Na2MoO4, 0.01% NP-40, and 0.5 mg mL−1 BGG) was added to...
ACS Chem Biol 12: 244-253 (2017)
Article DOI: 10.1021/acschembio.6b00747
BindingDB Entry DOI: 10.7270/Q20000XQ
Heat shock protein HSP 90-alpha
(Homo sapiens (Human))
BDBM210952
(4-(2-(3-chlorobenzyl)-1H-pyrrol-1-yl)-2-(((1r,4r)-...)
Show SMILES NC(=O)c1ccc(cc1NC1CCC(O)CC1)-n1cccc1Cc1cccc(Cl)c1 |(2.47,4.51,;3.8,3.74,;5.14,4.51,;3.8,2.2,;2.47,1.43,;2.47,-.11,;3.8,-.88,;5.14,-.11,;5.14,1.43,;6.47,2.2,;7.8,1.43,;9.14,2.2,;10.47,1.43,;10.47,-.11,;11.8,-.88,;9.14,-.88,;7.8,-.11,;3.8,-2.42,;2.56,-3.33,;3.03,-4.79,;4.57,-4.79,;5.05,-3.33,;6.51,-2.85,;7.66,-3.88,;7.34,-5.39,;8.48,-6.42,;9.95,-5.95,;10.27,-4.44,;11.73,-3.96,;9.12,-3.41,)|
Show InChI InChI=1S/C24H26ClN3O2/c25-17-4-1-3-16(13-17)14-19-5-2-12-28(19)20-8-11-22(24(26)30)23(15-20)27-18-6-9-21(29)10-7-18/h1-5,8,11-13,15,18,21,27,29H,6-7,9-10,14H2,(H2,26,30)
NCI pathway
Reactome pathway
US Patent
n/an/an/a>1.00E+5n/an/an/an/an/a
University of Kansas; University of South Florida
US Patent
Assay Description
Assay buffer (25 μL, 20 mM HEPES pH 7.3, 50 mM KCl, 5 mM MgCl2, 1 mM DTT, 20 mM Na2MoO4, 0.01% NP-40, and 0.5 mg/mL BGG) was added to 96-well pl...
US Patent US10975030 (2021)
Heat shock protein HSP 90-alpha
(Homo sapiens (Human))
BDBM210952
(4-(2-(3-chlorobenzyl)-1H-pyrrol-1-yl)-2-(((1r,4r)-...)
Show SMILES NC(=O)c1ccc(cc1NC1CCC(O)CC1)-n1cccc1Cc1cccc(Cl)c1 |(2.47,4.51,;3.8,3.74,;5.14,4.51,;3.8,2.2,;2.47,1.43,;2.47,-.11,;3.8,-.88,;5.14,-.11,;5.14,1.43,;6.47,2.2,;7.8,1.43,;9.14,2.2,;10.47,1.43,;10.47,-.11,;11.8,-.88,;9.14,-.88,;7.8,-.11,;3.8,-2.42,;2.56,-3.33,;3.03,-4.79,;4.57,-4.79,;5.05,-3.33,;6.51,-2.85,;7.66,-3.88,;7.34,-5.39,;8.48,-6.42,;9.95,-5.95,;10.27,-4.44,;11.73,-3.96,;9.12,-3.41,)|
Show InChI InChI=1S/C24H26ClN3O2/c25-17-4-1-3-16(13-17)14-19-5-2-12-28(19)20-8-11-22(24(26)30)23(15-20)27-18-6-9-21(29)10-7-18/h1-5,8,11-13,15,18,21,27,29H,6-7,9-10,14H2,(H2,26,30)
NCI pathway
Reactome pathway
n/an/an/a>1.00E+5n/an/an/a7.3n/a
The University of Kansas
Assay Description
Assay buffer (25 μL, 20 mM HEPES at pH 7.3, 50 mM KCl, 5 mM MgCl2, 1 mM DTT, 20 mM Na2MoO4, 0.01% NP-40, and 0.5 mg mL−1 BGG) was added to...
ACS Chem Biol 12: 244-253 (2017)
Article DOI: 10.1021/acschembio.6b00747
BindingDB Entry DOI: 10.7270/Q20000XQ