BDBM211 2-methoxyethyl N-[(1S)-1-{[(2S,3S)-4-[(2S)-N'-(cyclohexylmethyl)-2-[(methoxycarbonyl)amino]-3-methylbutanehydrazido]-3-hydroxy-1-phenylbutan-2-yl]carbamoyl}-2-methylpropyl]carbamate::CGP 53820 analog
SMILES: COCCOC(=O)N[C@@H](C(C)C)C(=O)N[C@@H](Cc1ccccc1)[C@@H](O)CN(CC1CCCCC1)NC(=O)[C@@H](NC(=O)OC)C(C)C
InChI Key: InChIKey=RIZULOWDBGNKDX-DZUOILHNSA-N
Data: 1 IC50
Activity Spreadsheet -- Enzyme Inhibition Constant Data from BindingDB
Found 1 hit for monomerid = 211
Trg + Lig
Ki
nM
ΔG°
kcal/mole
IC50
nM
Kd
nM
EC50/IC50
nM
koff
s-1
kon
M-1s-1
pHTemp
°C
HIV-1 Protease
(Human immunodeficiency virus type 1)
BDBM211
(2-methoxyethyl N-[(1S)-1-{[(2S,3S)-4-[(2S)-N'-(cyc...)
Show SMILES COCCOC(=O)N[C@@H](C(C)C)C(=O)N[C@@H](Cc1ccccc1)[C@@H](O)CN(CC1CCCCC1)NC(=O)[C@@H](NC(=O)OC)C(C)C |r|
Show InChI InChI=1S/C33H55N5O8/c1-22(2)28(36-33(43)46-18-17-44-5)30(40)34-26(19-24-13-9-7-10-14-24)27(39)21-38(20-25-15-11-8-12-16-25)37-31(41)29(23(3)4)35-32(42)45-6/h7,9-10,13-14,22-23,25-29,39H,8,11-12,15-21H2,1-6H3,(H,34,40)(H,35,42)(H,36,43)(H,37,41)/t26-,27-,28-,29-/m0/s1
n/an/a 62n/an/an/an/a6.037
Ciba-Geigy Ltd.
Assay Description
A peptide cleavage assay was performed using the icosapeptide H-Arg-Arg-Ser-Asn-Gln-Val-Ser-Gln-Asn-Tyr-Pro-Ile-Val-Gln-Asn-Ile-Gln-Gly-Arg-Arg-OH, a...
J Med Chem 39: 3203-16 (1996)
Article DOI: 10.1021/jm960022p
BindingDB Entry DOI: 10.7270/Q2FT8J7Q