BDBM21124 (2S)-2-[(2S)-2-{2-[(2R)-2-[(2S)-2-amino-3-(4-hydroxyphenyl)propanamido]propanamido]acetamido}-3-phenylpropanamido]-4-methylpentanamide::2-Ala-Leu-enkephalinamide::DALEA::H-Tyr-D-Ala-Gly -Phe-Leu-NH2::[D-Ala2, Leu5]enkephalin amide
SMILES: CC(C)C[C@H](NC(=O)[C@H](Cc1ccccc1)NC(=O)CNC(=O)[C@@H](C)NC(=O)[C@@H](N)Cc1ccc(O)cc1)C(N)=O
InChI Key: InChIKey=YPERDMXQKOFCQT-JMBSJVKXSA-N
Data: 2 KI
Activity Spreadsheet -- Enzyme Inhibition Constant Data from BindingDB
Found 2 hits for monomerid = 21124
Trg + Lig
Ki
nM
ΔG°
kcal/mole
IC50
nM
Kd
nM
EC50/IC50
nM
koff
s-1
kon
M-1s-1
pHTemp
°C
Delta-type opioid receptor
(Homo sapiens (Human))
BDBM21124
((2S)-2-[(2S)-2-{2-[(2R)-2-[(2S)-2-amino-3-(4-hydro...)
Show SMILES CC(C)C[C@H](NC(=O)[C@H](Cc1ccccc1)NC(=O)CNC(=O)[C@@H](C)NC(=O)[C@@H](N)Cc1ccc(O)cc1)C(N)=O
Show InChI InChI=1S/C29H40N6O6/c1-17(2)13-23(26(31)38)35-29(41)24(15-19-7-5-4-6-8-19)34-25(37)16-32-27(39)18(3)33-28(40)22(30)14-20-9-11-21(36)12-10-20/h4-12,17-18,22-24,36H,13-16,30H2,1-3H3,(H2,31,38)(H,32,39)(H,33,40)(H,34,37)(H,35,41)/t18-,22+,23+,24+/m1/s1
Reactome pathway
2.40 -11.8n/an/an/an/an/a7.425
University of Arizona at Tucson
Assay Description
Log IC50 values for each test compound were determined from nonlinear regression analysis of data collected from two independent experiments performe...
J Med Chem 50: 5528-32 (2007)
Article DOI: 10.1021/jm061465o
BindingDB Entry DOI: 10.7270/Q2D50K8P
Mu-type opioid receptor
(Rattus norvegicus (rat))
BDBM21124
((2S)-2-[(2S)-2-{2-[(2R)-2-[(2S)-2-amino-3-(4-hydro...)
Show SMILES CC(C)C[C@H](NC(=O)[C@H](Cc1ccccc1)NC(=O)CNC(=O)[C@@H](C)NC(=O)[C@@H](N)Cc1ccc(O)cc1)C(N)=O
Show InChI InChI=1S/C29H40N6O6/c1-17(2)13-23(26(31)38)35-29(41)24(15-19-7-5-4-6-8-19)34-25(37)16-32-27(39)18(3)33-28(40)22(30)14-20-9-11-21(36)12-10-20/h4-12,17-18,22-24,36H,13-16,30H2,1-3H3,(H2,31,38)(H,32,39)(H,33,40)(H,34,37)(H,35,41)/t18-,22+,23+,24+/m1/s1
Reactome pathway
7.70 -11.1n/an/an/an/an/a7.425
University of Arizona at Tucson
Assay Description
Log IC50 values for each test compound were determined from nonlinear regression analysis of data collected from two independent experiments performe...
J Med Chem 50: 5528-32 (2007)
Article DOI: 10.1021/jm061465o
BindingDB Entry DOI: 10.7270/Q2D50K8P