null
SMILES: Clc1ccccc1-c1nc2cccc(Br)n2c1NC1CCCCC1
InChI Key: InChIKey=RTYYJLSJCNMVCO-UHFFFAOYSA-N
Activity Spreadsheet -- Enzyme Inhibition Constant Data from BindingDB
Found 2 hits for monomerid = 2116
Trg + Lig
Ki
nM
ΔG°
kcal/mole
IC50
nM
Kd
nM
EC50/IC50
nM
koff
s-1
kon
M-1s-1
pHTemp
°C
Reverse transcriptase
(Human immunodeficiency virus 1)
BDBM2116
(DG 402-49706 | US8501787, 42)
Show SMILES Clc1ccccc1-c1nc2cccc(Br)n2c1NC1CCCCC1
Show InChI InChI=1S/C19H19BrClN3/c20-16-11-6-12-17-23-18(14-9-4-5-10-15(14)21)19(24(16)17)22-13-7-2-1-3-8-13/h4-6,9-13,22H,1-3,7-8H2
n/an/a 4.62E+3n/an/an/an/an/an/a
CSIR Biosciences
Curated by ChEMBL
Assay Description
Inhibition of HIV1 reverse transcriptase assessed as residual enzyme activity at 50 uM after 1 hr by ELISA
Bioorg Med Chem 19: 4227-37 (2011)
Article DOI: 10.1016/j.bmc.2011.05.062
BindingDB Entry DOI: 10.7270/Q29K4F22
Reverse transcriptase protein
(Human immunodeficiency virus 1)
BDBM2116
(DG 402-49706 | US8501787, 42)
Show SMILES Clc1ccccc1-c1nc2cccc(Br)n2c1NC1CCCCC1
Show InChI InChI=1S/C19H19BrClN3/c20-16-11-6-12-17-23-18(14-9-4-5-10-15(14)21)19(24(16)17)22-13-7-2-1-3-8-13/h4-6,9-13,22H,1-3,7-8H2
US Patent
n/an/a 4.62E+3n/an/an/an/an/an/a
CSIR
US Patent
Assay Description
The assay is based on a sandwich-ELISA protocol employing the ROCHE colorimetric reverse transcriptase kit (cat # 1468120910).
US Patent US8501767 (2013)
BindingDB Entry DOI: 10.7270/Q2Z60MPS