BDBM211745 US9290459, 7.9::US9670166, 7.9
SMILES: CN1CC(CC1=O)NC(=O)N1C(C2=C(CCC2=O)N(C1=O)c1cccc(c1)C(F)(F)F)c1ccc(cc1)C#N
InChI Key: InChIKey=DPRBZPODWBUMNW-UHFFFAOYSA-N
Data: 2 IC50  1 EC50
Activity Spreadsheet -- Enzyme Inhibition Constant Data from BindingDB
Found 3 hits for monomerid = 211745
Trg + Lig
Ki
nM
ΔG°
kcal/mole
IC50
nM
Kd
nM
EC50/IC50
nM
koff
s-1
kon
M-1s-1
pHTemp
°C
Neutrophil elastase
(Homo sapiens (Human))
BDBM211745
(US9290459, 7.9 | US9670166, 7.9)
Show SMILES CN1CC(CC1=O)NC(=O)N1C(C2=C(CCC2=O)N(C1=O)c1cccc(c1)C(F)(F)F)c1ccc(cc1)C#N |t:13|
Show InChI InChI=1S/C27H22F3N5O4/c1-33-14-18(12-22(33)37)32-25(38)35-24(16-7-5-15(13-31)6-8-16)23-20(9-10-21(23)36)34(26(35)39)19-4-2-3-17(11-19)27(28,29)30/h2-8,11,18,24H,9-10,12,14H2,1H3,(H,32,38)
Reactome pathway
US Patent
n/an/an/an/a 1n/an/a7.5n/a
Boehringer Ingelheim International GmbH
US Patent
Assay Description
Various concentrations of the neutrophil elastase inhibitor are incubated with plasma. Subsequently, the enzyme activity is measured using the fluoro...
US Patent US9290459 (2016)
BindingDB Entry DOI: 10.7270/Q2KS6QD5
Neutrophil elastase
(Homo sapiens (Human))
BDBM211745
(US9290459, 7.9 | US9670166, 7.9)
Show SMILES CN1CC(CC1=O)NC(=O)N1C(C2=C(CCC2=O)N(C1=O)c1cccc(c1)C(F)(F)F)c1ccc(cc1)C#N |t:13|
Show InChI InChI=1S/C27H22F3N5O4/c1-33-14-18(12-22(33)37)32-25(38)35-24(16-7-5-15(13-31)6-8-16)23-20(9-10-21(23)36)34(26(35)39)19-4-2-3-17(11-19)27(28,29)30/h2-8,11,18,24H,9-10,12,14H2,1H3,(H,32,38)
Reactome pathway
US Patent
n/an/a<1n/an/an/an/a7.525
Boehringer Ingelheim International GmbH
US Patent
Assay Description
Materials: Human neutrophil elastase was purchased from Calbiochem (Cat. No.: 324681) and the elastase substrate MeOSuc-Ala-Ala-Pro-Val-AMC from Bach...
US Patent US9670166 (2017)
BindingDB Entry DOI: 10.7270/Q25Q4T8F
Neutrophil elastase
(Homo sapiens (Human))
BDBM211745
(US9290459, 7.9 | US9670166, 7.9)
Show SMILES CN1CC(CC1=O)NC(=O)N1C(C2=C(CCC2=O)N(C1=O)c1cccc(c1)C(F)(F)F)c1ccc(cc1)C#N |t:13|
Show InChI InChI=1S/C27H22F3N5O4/c1-33-14-18(12-22(33)37)32-25(38)35-24(16-7-5-15(13-31)6-8-16)23-20(9-10-21(23)36)34(26(35)39)19-4-2-3-17(11-19)27(28,29)30/h2-8,11,18,24H,9-10,12,14H2,1H3,(H,32,38)
Reactome pathway
US Patent
n/an/a<1n/an/an/an/a7.525
Boehringer Ingelheim International GmbH
US Patent
Assay Description
Materials: Human neutrophil elastase was purchased from Calbiochem (Cat. No.: 324681) and the elastase substrate MeOSuc-Ala-Ala-Pro-Val-AMC from Bach...
US Patent US9290459 (2016)
BindingDB Entry DOI: 10.7270/Q2KS6QD5