BDBM211754 US9290459, 9A::US9670166, 9A
SMILES: CS(=O)(=O)N1[C@@H](C2=C(CCC2=O)N(C1=O)c1cccc(c1)C(F)(F)F)c1ccc(cc1)C#N
InChI Key: InChIKey=ZSGUFCFIQTTZBC-HXUWFJFHSA-N
Data: 8 IC50  1 EC50
Activity Spreadsheet -- Enzyme Inhibition Constant Data from BindingDB
Found 9 hits for monomerid = 211754
Trg + Lig
Ki
nM
ΔG°
kcal/mole
IC50
nM
Kd
nM
EC50/IC50
nM
koff
s-1
kon
M-1s-1
pHTemp
°C
Leukocyte elastase
(Homo sapiens (Human))
BDBM211754
(US9290459, 9A | US9670166, 9A)
Show SMILES CS(=O)(=O)N1[C@@H](C2=C(CCC2=O)N(C1=O)c1cccc(c1)C(F)(F)F)c1ccc(cc1)C#N |r,t:6|
Show InChI InChI=1S/C22H16F3N3O4S/c1-33(31,32)28-20(14-7-5-13(12-26)6-8-14)19-17(9-10-18(19)29)27(21(28)30)16-4-2-3-15(11-16)22(23,24)25/h2-8,11,20H,9-10H2,1H3/t20-/m1/s1
Reactome pathway
US Patent
n/an/an/an/a 2n/an/a7.5n/a
Boehringer Ingelheim International GmbH
US Patent
Assay Description
Various concentrations of the neutrophil elastase inhibitor are incubated with plasma. Subsequently, the enzyme activity is measured using the fluoro...
US Patent US9290459 (2016)
BindingDB Entry DOI: 10.7270/Q2KS6QD5
Leukocyte elastase
(Homo sapiens (Human))
BDBM211754
(US9290459, 9A | US9670166, 9A)
Show SMILES CS(=O)(=O)N1[C@@H](C2=C(CCC2=O)N(C1=O)c1cccc(c1)C(F)(F)F)c1ccc(cc1)C#N |r,t:6|
Show InChI InChI=1S/C22H16F3N3O4S/c1-33(31,32)28-20(14-7-5-13(12-26)6-8-14)19-17(9-10-18(19)29)27(21(28)30)16-4-2-3-15(11-16)22(23,24)25/h2-8,11,20H,9-10H2,1H3/t20-/m1/s1
Reactome pathway
US Patent
n/an/a 3n/an/an/an/a7.525
Boehringer Ingelheim International GmbH
US Patent
Assay Description
Materials: Human neutrophil elastase was purchased from Calbiochem (Cat. No.: 324681) and the elastase substrate MeOSuc-Ala-Ala-Pro-Val-AMC from Bach...
US Patent US9290459 (2016)
BindingDB Entry DOI: 10.7270/Q2KS6QD5
Cytochrome P450 2C9
(Homo sapiens (Human))
BDBM211754
(US9290459, 9A | US9670166, 9A)
Show SMILES CS(=O)(=O)N1[C@@H](C2=C(CCC2=O)N(C1=O)c1cccc(c1)C(F)(F)F)c1ccc(cc1)C#N |r,t:6|
Show InChI InChI=1S/C22H16F3N3O4S/c1-33(31,32)28-20(14-7-5-13(12-26)6-8-14)19-17(9-10-18(19)29)27(21(28)30)16-4-2-3-15(11-16)22(23,24)25/h2-8,11,20H,9-10H2,1H3/t20-/m1/s1
Reactome pathway
US Patent
n/an/a>5.00E+4n/an/an/an/an/a37
Boehringer Ingelheim International GmbH
US Patent
Assay Description
The inhibition of cytochrome P450 2C9-isoenzyme catalysed hydroxylation of Diclofenac by the test compound is assayed at 37° C. with human liver ...
US Patent US9290459 (2016)
BindingDB Entry DOI: 10.7270/Q2KS6QD5
Cytochrome P450 2C19
(Homo sapiens (Human))
BDBM211754
(US9290459, 9A | US9670166, 9A)
Show SMILES CS(=O)(=O)N1[C@@H](C2=C(CCC2=O)N(C1=O)c1cccc(c1)C(F)(F)F)c1ccc(cc1)C#N |r,t:6|
Show InChI InChI=1S/C22H16F3N3O4S/c1-33(31,32)28-20(14-7-5-13(12-26)6-8-14)19-17(9-10-18(19)29)27(21(28)30)16-4-2-3-15(11-16)22(23,24)25/h2-8,11,20H,9-10H2,1H3/t20-/m1/s1
Reactome pathway
US Patent
n/an/a>5.00E+4n/an/an/an/an/a37
Boehringer Ingelheim International GmbH
US Patent
Assay Description
The inhibition of cytochrome P450 2C19-isoenzyme catalysed hydroxylation of Mephenytoin by the test compound is assayed at 37° C. with human live...
US Patent US9290459 (2016)
BindingDB Entry DOI: 10.7270/Q2KS6QD5
Cytochrome P450 2C8
(Homo sapiens (Human))
BDBM211754
(US9290459, 9A | US9670166, 9A)
Show SMILES CS(=O)(=O)N1[C@@H](C2=C(CCC2=O)N(C1=O)c1cccc(c1)C(F)(F)F)c1ccc(cc1)C#N |r,t:6|
Show InChI InChI=1S/C22H16F3N3O4S/c1-33(31,32)28-20(14-7-5-13(12-26)6-8-14)19-17(9-10-18(19)29)27(21(28)30)16-4-2-3-15(11-16)22(23,24)25/h2-8,11,20H,9-10H2,1H3/t20-/m1/s1
US Patent
n/an/a>5.00E+4n/an/an/an/a7.525
Boehringer Ingelheim International GmbH
US Patent
Assay Description
Materials: Human neutrophil elastase was purchased from Calbiochem (Cat. No.: 324681) and the elastase substrate MeOSuc-Ala-Ala-Pro-Val-AMC from Bach...
US Patent US9670166 (2017)
BindingDB Entry DOI: 10.7270/Q25Q4T8F
Leukocyte elastase
(Homo sapiens (Human))
BDBM211754
(US9290459, 9A | US9670166, 9A)
Show SMILES CS(=O)(=O)N1[C@@H](C2=C(CCC2=O)N(C1=O)c1cccc(c1)C(F)(F)F)c1ccc(cc1)C#N |r,t:6|
Show InChI InChI=1S/C22H16F3N3O4S/c1-33(31,32)28-20(14-7-5-13(12-26)6-8-14)19-17(9-10-18(19)29)27(21(28)30)16-4-2-3-15(11-16)22(23,24)25/h2-8,11,20H,9-10H2,1H3/t20-/m1/s1
Reactome pathway
US Patent
n/an/a 3n/an/an/an/a7.525
Boehringer Ingelheim International GmbH
US Patent
Assay Description
Materials: Human neutrophil elastase was purchased from Calbiochem (Cat. No.: 324681) and the elastase substrate MeOSuc-Ala-Ala-Pro-Val-AMC from Bach...
US Patent US9670166 (2017)
BindingDB Entry DOI: 10.7270/Q25Q4T8F
Cytochrome P450 2C9
(Homo sapiens (Human))
BDBM211754
(US9290459, 9A | US9670166, 9A)
Show SMILES CS(=O)(=O)N1[C@@H](C2=C(CCC2=O)N(C1=O)c1cccc(c1)C(F)(F)F)c1ccc(cc1)C#N |r,t:6|
Show InChI InChI=1S/C22H16F3N3O4S/c1-33(31,32)28-20(14-7-5-13(12-26)6-8-14)19-17(9-10-18(19)29)27(21(28)30)16-4-2-3-15(11-16)22(23,24)25/h2-8,11,20H,9-10H2,1H3/t20-/m1/s1
Reactome pathway
US Patent
n/an/a>5.00E+4n/an/an/an/a7.525
Boehringer Ingelheim International GmbH
US Patent
Assay Description
Materials: Human neutrophil elastase was purchased from Calbiochem (Cat. No.: 324681) and the elastase substrate MeOSuc-Ala-Ala-Pro-Val-AMC from Bach...
US Patent US9670166 (2017)
BindingDB Entry DOI: 10.7270/Q25Q4T8F
Cytochrome P450 2C19
(Homo sapiens (Human))
BDBM211754
(US9290459, 9A | US9670166, 9A)
Show SMILES CS(=O)(=O)N1[C@@H](C2=C(CCC2=O)N(C1=O)c1cccc(c1)C(F)(F)F)c1ccc(cc1)C#N |r,t:6|
Show InChI InChI=1S/C22H16F3N3O4S/c1-33(31,32)28-20(14-7-5-13(12-26)6-8-14)19-17(9-10-18(19)29)27(21(28)30)16-4-2-3-15(11-16)22(23,24)25/h2-8,11,20H,9-10H2,1H3/t20-/m1/s1
Reactome pathway
US Patent
n/an/a>5.00E+4n/an/an/an/a7.525
Boehringer Ingelheim International GmbH
US Patent
Assay Description
Materials: Human neutrophil elastase was purchased from Calbiochem (Cat. No.: 324681) and the elastase substrate MeOSuc-Ala-Ala-Pro-Val-AMC from Bach...
US Patent US9670166 (2017)
BindingDB Entry DOI: 10.7270/Q25Q4T8F
Cytochrome P450 2C8
(Homo sapiens (Human))
BDBM211754
(US9290459, 9A | US9670166, 9A)
Show SMILES CS(=O)(=O)N1[C@@H](C2=C(CCC2=O)N(C1=O)c1cccc(c1)C(F)(F)F)c1ccc(cc1)C#N |r,t:6|
Show InChI InChI=1S/C22H16F3N3O4S/c1-33(31,32)28-20(14-7-5-13(12-26)6-8-14)19-17(9-10-18(19)29)27(21(28)30)16-4-2-3-15(11-16)22(23,24)25/h2-8,11,20H,9-10H2,1H3/t20-/m1/s1
US Patent
n/an/a>5.00E+4n/an/an/an/an/a37
Boehringer Ingelheim International GmbH
US Patent
Assay Description
The inhibition of cytochrome P450 2C8-isoenzyme catalysed deethylation of Amodiaquine by the test compound is assayed at 37° C. with human liver ...
US Patent US9290459 (2016)
BindingDB Entry DOI: 10.7270/Q2KS6QD5