BDBM212113 US9290485, 145
SMILES: Cc1cc(N)nc(C)c1CNC(=O)c1cnn(Cc2ccc(Cn3cccn3)cc2)c1
InChI Key: InChIKey=OINOKQVNBGAIMA-UHFFFAOYSA-N
Data: 1 IC50
PDB links: 2 PDB IDs match this monomer.
Activity Spreadsheet -- Enzyme Inhibition Constant Data from BindingDB
Found 1 hit for monomerid = 212113
Trg + Lig
Ki
nM
ΔG°
kcal/mole
IC50
nM
Kd
nM
EC50/IC50
nM
koff
s-1
kon
M-1s-1
pHTemp
°C
Plasma kallikrein
(Homo sapiens (Human))
BDBM212113
(US9290485, 145)
Show SMILES Cc1cc(N)nc(C)c1CNC(=O)c1cnn(Cc2ccc(Cn3cccn3)cc2)c1
Show InChI InChI=1S/C23H25N7O/c1-16-10-22(24)28-17(2)21(16)12-25-23(31)20-11-27-30(15-20)14-19-6-4-18(5-7-19)13-29-9-3-8-26-29/h3-11,15H,12-14H2,1-2H3,(H2,24,28)(H,25,31)
US Patent
n/an/a 0.200n/an/an/an/a7.825
NOVARTIS AG
US Patent
Assay Description
Enzymatic reactions were conducted in â¿¿assay bufferâ¿¿, comprising 50 mM Hepes/NaOH at pH 7.8, 150 mM NaCl, 1 mM EDTA and 0.05% (w/v) CHAPS. For th...
US Patent US9290485 (2016)
BindingDB Entry DOI: 10.7270/Q26H4G73
3D
3D Structure (crystal)