BDBM212116 US9290485, 148
SMILES: Cc1cc(C)n(Cc2ccc(Cn3cc(nn3)C(=O)NCc3c(C)cc(N)nc3C)cc2)n1
InChI Key: InChIKey=FGZWHKYFVTWNMF-UHFFFAOYSA-N
Data: 1 IC50
Activity Spreadsheet -- Enzyme Inhibition Constant Data from BindingDB
Found 1 hit for monomerid = 212116
Trg + Lig
Ki
nM
ΔG°
kcal/mole
IC50
nM
Kd
nM
EC50/IC50
nM
koff
s-1
kon
M-1s-1
pHTemp
°C
Plasma kallikrein
(Homo sapiens (Human))
BDBM212116
(US9290485, 148)
Show SMILES Cc1cc(C)n(Cc2ccc(Cn3cc(nn3)C(=O)NCc3c(C)cc(N)nc3C)cc2)n1
Show InChI InChI=1S/C24H28N8O/c1-15-9-23(25)27-18(4)21(15)11-26-24(33)22-14-31(30-28-22)12-19-5-7-20(8-6-19)13-32-17(3)10-16(2)29-32/h5-10,14H,11-13H2,1-4H3,(H2,25,27)(H,26,33)
US Patent
n/an/a 0.0300n/an/an/an/a7.825
NOVARTIS AG
US Patent
Assay Description
Enzymatic reactions were conducted in â¿¿assay bufferâ¿¿, comprising 50 mM Hepes/NaOH at pH 7.8, 150 mM NaCl, 1 mM EDTA and 0.05% (w/v) CHAPS. For th...
US Patent US9290485 (2016)
BindingDB Entry DOI: 10.7270/Q26H4G73