BDBM212408 US9290507, II-21
SMILES: Cc1ccc(NC(=O)c2ccc(o2)C(C)(C)C)cc1-n1cc(nn1)-c1cncc(c1)N1CCNCC1
InChI Key: InChIKey=SEUPGAKGRSBRCW-UHFFFAOYSA-N
Data: 1 IC50
Activity Spreadsheet -- Enzyme Inhibition Constant Data from BindingDB
Found 1 hit for monomerid = 212408
Trg + Lig
Ki
nM
ΔG°
kcal/mole
IC50
nM
Kd
nM
EC50/IC50
nM
koff
s-1
kon
M-1s-1
pHTemp
°C
Serine/threonine-protein kinase B-raf
(Homo sapiens (Human))
BDBM212408
(US9290507, II-21)
Show SMILES Cc1ccc(NC(=O)c2ccc(o2)C(C)(C)C)cc1-n1cc(nn1)-c1cncc(c1)N1CCNCC1
Show InChI InChI=1S/C27H31N7O2/c1-18-5-6-20(30-26(35)24-7-8-25(36-24)27(2,3)4)14-23(18)34-17-22(31-32-34)19-13-21(16-29-15-19)33-11-9-28-10-12-33/h5-8,13-17,28H,9-12H2,1-4H3,(H,30,35)
NCI pathway
Reactome pathway
US Patent
n/an/a 1n/an/an/an/a7.5n/a
Boehringer Ingelheim International GmbH
US Patent
Assay Description
In a dilution series 10 uL/well of test substance solution are placed in a multiwell plate. The dilution series is selected so that generally a range...
US Patent US9290507 (2016)
BindingDB Entry DOI: 10.7270/Q2PK0F1H