BDBM21257 N-cyclohexyl-1-(2,4-dichlorophenyl)-4-methyl-5-(1H-pyrrol-1-yl)-1H-pyrazole-3-carboxamide::Pyrazole-3-carboxamide analogue, 24
SMILES: Cc1c(nn(c1-n1cccc1)-c1ccc(Cl)cc1Cl)C(=O)NC1CCCCC1
InChI Key: InChIKey=IEDOQPJIOGYHSJ-UHFFFAOYSA-N
Data: 2 KI
Activity Spreadsheet -- Enzyme Inhibition Constant Data from BindingDB
Found 2 hits for monomerid = 21257
Trg + Lig
Ki
nM
ΔG°
kcal/mole
IC50
nM
Kd
nM
EC50/IC50
nM
koff
s-1
kon
M-1s-1
pHTemp
°C
Cannabinoid receptor 1
(Homo sapiens (Human))
BDBM21257
(N-cyclohexyl-1-(2,4-dichlorophenyl)-4-methyl-5-(1H...)
Show SMILES Cc1c(nn(c1-n1cccc1)-c1ccc(Cl)cc1Cl)C(=O)NC1CCCCC1
Show InChI InChI=1S/C21H22Cl2N4O/c1-14-19(20(28)24-16-7-3-2-4-8-16)25-27(21(14)26-11-5-6-12-26)18-10-9-15(22)13-17(18)23/h5-6,9-13,16H,2-4,7-8H2,1H3,(H,24,28)
NCI pathway
Reactome pathway
56 -10.1n/an/an/an/an/a7.430
Sapienza Universitāadi Roma
Assay Description
IC50 values for test compounds were determined from nonlinear regression analysis of data collected from ligand binding experiments. The inhibition c...
J Med Chem 51: 1560-76 (2008)
Article DOI: 10.1021/jm070566z
BindingDB Entry DOI: 10.7270/Q2GX48V9
Cannabinoid receptor 2
(Homo sapiens (Human))
BDBM21257
(N-cyclohexyl-1-(2,4-dichlorophenyl)-4-methyl-5-(1H...)
Show SMILES Cc1c(nn(c1-n1cccc1)-c1ccc(Cl)cc1Cl)C(=O)NC1CCCCC1
Show InChI InChI=1S/C21H22Cl2N4O/c1-14-19(20(28)24-16-7-3-2-4-8-16)25-27(21(14)26-11-5-6-12-26)18-10-9-15(22)13-17(18)23/h5-6,9-13,16H,2-4,7-8H2,1H3,(H,24,28)
Reactome pathway
64n/an/an/an/an/an/an/an/a
Sapienza Universitāadi Roma
Assay Description
IC50 values for test compounds were determined from nonlinear regression analysis of data collected from ligand binding experiments. The inhibition c...
J Med Chem 51: 1560-76 (2008)
Article DOI: 10.1021/jm070566z
BindingDB Entry DOI: 10.7270/Q2GX48V9