null
SMILES: Clc1ccccc1-c1nc2cccc(Cl)n2c1NC1CCCC1
InChI Key: InChIKey=JFXFRWXPDOGEDC-UHFFFAOYSA-N
Activity Spreadsheet -- Enzyme Inhibition Constant Data from BindingDB
Found 1 hit for monomerid = 2126
Trg + Lig
Ki
nM
ΔG°
kcal/mole
IC50
nM
Kd
nM
EC50/IC50
nM
koff
s-1
kon
M-1s-1
pHTemp
°C
Reverse transcriptase protein
(Human immunodeficiency virus 1)
BDBM2126
(DG 402-49760 | US8501787, 48)
Show SMILES Clc1ccccc1-c1nc2cccc(Cl)n2c1NC1CCCC1
Show InChI InChI=1S/C18H17Cl2N3/c19-14-9-4-3-8-13(14)17-18(21-12-6-1-2-7-12)23-15(20)10-5-11-16(23)22-17/h3-5,8-12,21H,1-2,6-7H2
US Patent
n/an/a 5.14E+3n/an/an/an/an/an/a
CSIR
US Patent
Assay Description
The assay is based on a sandwich-ELISA protocol employing the ROCHE colorimetric reverse transcriptase kit (cat # 1468120910).
US Patent US8501767 (2013)
BindingDB Entry DOI: 10.7270/Q2Z60MPS