BDBM21262 1-(3,4-dichlorophenyl)-N-[(3,4-dichlorophenyl)methyl]-4-methyl-5-(1H-pyrrol-1-yl)-1H-pyrazole-3-carboxamide::Pyrazole-3-carboxamide analogue, 29
SMILES: Cc1c(nn(c1-n1cccc1)-c1ccc(Cl)c(Cl)c1)C(=O)NCc1ccc(Cl)c(Cl)c1
InChI Key: InChIKey=FJOMFDMZEGTXGE-UHFFFAOYSA-N
Data: 2 KI
Activity Spreadsheet -- Enzyme Inhibition Constant Data from BindingDB
Found 2 hits for monomerid = 21262
Trg + Lig
Ki
nM
ΔG°
kcal/mole
IC50
nM
Kd
nM
EC50/IC50
nM
koff
s-1
kon
M-1s-1
pHTemp
°C
Cannabinoid receptor 1
(Homo sapiens (Human))
BDBM21262
(1-(3,4-dichlorophenyl)-N-[(3,4-dichlorophenyl)meth...)
Show SMILES Cc1c(nn(c1-n1cccc1)-c1ccc(Cl)c(Cl)c1)C(=O)NCc1ccc(Cl)c(Cl)c1
Show InChI InChI=1S/C22H16Cl4N4O/c1-13-20(21(31)27-12-14-4-6-16(23)18(25)10-14)28-30(22(13)29-8-2-3-9-29)15-5-7-17(24)19(26)11-15/h2-11H,12H2,1H3,(H,27,31)
NCI pathway
Reactome pathway
35 -10.3n/an/an/an/an/a7.430
Sapienza Universitāadi Roma
Assay Description
IC50 values for test compounds were determined from nonlinear regression analysis of data collected from ligand binding experiments. The inhibition c...
J Med Chem 51: 1560-76 (2008)
Article DOI: 10.1021/jm070566z
BindingDB Entry DOI: 10.7270/Q2GX48V9
Cannabinoid receptor 2
(Homo sapiens (Human))
BDBM21262
(1-(3,4-dichlorophenyl)-N-[(3,4-dichlorophenyl)meth...)
Show SMILES Cc1c(nn(c1-n1cccc1)-c1ccc(Cl)c(Cl)c1)C(=O)NCc1ccc(Cl)c(Cl)c1
Show InChI InChI=1S/C22H16Cl4N4O/c1-13-20(21(31)27-12-14-4-6-16(23)18(25)10-14)28-30(22(13)29-8-2-3-9-29)15-5-7-17(24)19(26)11-15/h2-11H,12H2,1H3,(H,27,31)
Reactome pathway
150n/an/an/an/an/an/an/an/a
Sapienza Universitāadi Roma
Assay Description
IC50 values for test compounds were determined from nonlinear regression analysis of data collected from ligand binding experiments. The inhibition c...
J Med Chem 51: 1560-76 (2008)
Article DOI: 10.1021/jm070566z
BindingDB Entry DOI: 10.7270/Q2GX48V9