BDBM21296 1-(oxan-4-ylmethyl)-3-[(2,2,3,3-tetramethylcyclopropyl)carbonyl]-1H-indol-6-ol::Tetrahydropyranyl-methyl analogue, 17
SMILES: CC1(C)C(C(=O)c2cn(CC3CCOCC3)c3cc(O)ccc23)C1(C)C
InChI Key: InChIKey=YNHUJCRFFWWTHM-UHFFFAOYSA-N
Data: 4 KI  1 EC50
Activity Spreadsheet -- Enzyme Inhibition Constant Data from BindingDB
Found 4 hits for monomerid = 21296
Trg + Lig
Ki
nM
ΔG°
kcal/mole
IC50
nM
Kd
nM
EC50/IC50
nM
koff
s-1
kon
M-1s-1
pHTemp
°C
Cannabinoid receptor 2
(Homo sapiens (Human))
BDBM21296
(1-(oxan-4-ylmethyl)-3-[(2,2,3,3-tetramethylcyclopr...)
Show SMILES CC1(C)C(C(=O)c2cn(CC3CCOCC3)c3cc(O)ccc23)C1(C)C
Show InChI InChI=1S/C22H29NO3/c1-21(2)20(22(21,3)4)19(25)17-13-23(12-14-7-9-26-10-8-14)18-11-15(24)5-6-16(17)18/h5-6,11,13-14,20,24H,7-10,12H2,1-4H3
Reactome pathway
8.30n/an/an/an/an/an/an/an/a
Universit£ degli Studi di Siena
Curated by ChEMBL
Assay Description
Displacement of [3H]CP 55940 from human CB2 receptor in cell free system
Eur J Med Chem 46: 547-55 (2011)
Article DOI: 10.1016/j.ejmech.2010.11.034
BindingDB Entry DOI: 10.7270/Q2CF9QCJ
Cannabinoid receptor 2
(Homo sapiens (Human))
BDBM21296
(1-(oxan-4-ylmethyl)-3-[(2,2,3,3-tetramethylcyclopr...)
Show SMILES CC1(C)C(C(=O)c2cn(CC3CCOCC3)c3cc(O)ccc23)C1(C)C
Show InChI InChI=1S/C22H29NO3/c1-21(2)20(22(21,3)4)19(25)17-13-23(12-14-7-9-26-10-8-14)18-11-15(24)5-6-16(17)18/h5-6,11,13-14,20,24H,7-10,12H2,1-4H3
Reactome pathway
8.5n/an/an/a 18.5n/an/an/an/a
Abbott Laboratories
Assay Description
IC50 values for test compounds were determined from nonlinear regression analysis of data collected from ligand binding experiments. The inhibition c...
J Med Chem 51: 1904-12 (2008)
Article DOI: 10.1021/jm7011613
BindingDB Entry DOI: 10.7270/Q2C827K2
Cannabinoid receptor 1
(Homo sapiens (Human))
BDBM21296
(1-(oxan-4-ylmethyl)-3-[(2,2,3,3-tetramethylcyclopr...)
Show SMILES CC1(C)C(C(=O)c2cn(CC3CCOCC3)c3cc(O)ccc23)C1(C)C
Show InChI InChI=1S/C22H29NO3/c1-21(2)20(22(21,3)4)19(25)17-13-23(12-14-7-9-26-10-8-14)18-11-15(24)5-6-16(17)18/h5-6,11,13-14,20,24H,7-10,12H2,1-4H3
NCI pathway
Reactome pathway
2.95E+3n/an/an/an/an/an/an/an/a
Universit£ degli Studi di Siena
Curated by ChEMBL
Assay Description
Displacement of [3H]CP 55940 from human CB1 receptor in cell free system
Eur J Med Chem 46: 547-55 (2011)
Article DOI: 10.1016/j.ejmech.2010.11.034
BindingDB Entry DOI: 10.7270/Q2CF9QCJ
Cannabinoid receptor 1
(Homo sapiens (Human))
BDBM21296
(1-(oxan-4-ylmethyl)-3-[(2,2,3,3-tetramethylcyclopr...)
Show SMILES CC1(C)C(C(=O)c2cn(CC3CCOCC3)c3cc(O)ccc23)C1(C)C
Show InChI InChI=1S/C22H29NO3/c1-21(2)20(22(21,3)4)19(25)17-13-23(12-14-7-9-26-10-8-14)18-11-15(24)5-6-16(17)18/h5-6,11,13-14,20,24H,7-10,12H2,1-4H3
NCI pathway
Reactome pathway
>3.00E+3>-7.66n/an/an/an/an/a7.430
Abbott Laboratories
Assay Description
IC50 values for test compounds were determined from nonlinear regression analysis of data collected from ligand binding experiments. The inhibition c...
J Med Chem 51: 1904-12 (2008)
Article DOI: 10.1021/jm7011613
BindingDB Entry DOI: 10.7270/Q2C827K2