null
SMILES: NC(=O)c1cc(-c2ccc(F)cc2)c2ccc(Cc3ccnc(CO)c3)cc2n1
InChI Key: InChIKey=STYTUKPCJDSQIN-UHFFFAOYSA-N
Activity Spreadsheet -- Enzyme Inhibition Constant Data from BindingDB
Found 3 hits for monomerid = 213060
Trg + Lig
Ki
nM
ΔG°
kcal/mole
IC50
nM
Kd
nM
EC50/IC50
nM
koff
s-1
kon
M-1s-1
pHTemp
°C
Guanine nucleotide-binding protein subunit alpha-15 [Y147C]/Metabotropic glutamate receptor 2
(Homo sapiens (Human))
BDBM213060
(US9278960, 6-7 | US9663506, Example 6-7)
Show SMILES NC(=O)c1cc(-c2ccc(F)cc2)c2ccc(Cc3ccnc(CO)c3)cc2n1
Show InChI InChI=1S/C23H18FN3O2/c24-17-4-2-16(3-5-17)20-12-22(23(25)29)27-21-11-14(1-6-19(20)21)9-15-7-8-26-18(10-15)13-28/h1-8,10-12,28H,9,13H2,(H2,25,29)
US Patent
n/an/a 8n/an/an/an/an/an/a
Merck Sharp & Dohme Corp.
US Patent
Assay Description
The utility of the compounds in accordance with the present invention as antagonists of metabotropic glutamate receptor activity, in particular mGluR...
US Patent US9278960 (2016)
BindingDB Entry DOI: 10.7270/Q2MK6BQW
Metabotropic glutamate receptor 2
(Homo sapiens (Human))
BDBM213060
(US9278960, 6-7 | US9663506, Example 6-7)
Show SMILES NC(=O)c1cc(-c2ccc(F)cc2)c2ccc(Cc3ccnc(CO)c3)cc2n1
Show InChI InChI=1S/C23H18FN3O2/c24-17-4-2-16(3-5-17)20-12-22(23(25)29)27-21-11-14(1-6-19(20)21)9-15-7-8-26-18(10-15)13-28/h1-8,10-12,28H,9,13H2,(H2,25,29)
US Patent
n/an/a 8n/an/an/an/an/an/a
Merck Sharp & Dohme Corp.
US Patent
Assay Description
The utility of the compounds in accordance with the present invention as antagonists of metabotropic glutamate receptor activity, in particular mGluR...
US Patent US9663506 (2017)
BindingDB Entry DOI: 10.7270/Q2PC34H4
Metabotropic glutamate receptor 2
(Homo sapiens (Human))
BDBM213060
(US9278960, 6-7 | US9663506, Example 6-7)
Show SMILES NC(=O)c1cc(-c2ccc(F)cc2)c2ccc(Cc3ccnc(CO)c3)cc2n1
Show InChI InChI=1S/C23H18FN3O2/c24-17-4-2-16(3-5-17)20-12-22(23(25)29)27-21-11-14(1-6-19(20)21)9-15-7-8-26-18(10-15)13-28/h1-8,10-12,28H,9,13H2,(H2,25,29)
US Patent
n/an/a 8n/an/an/an/an/an/a
Merck Sharp & Dohme Corp.
US Patent
Assay Description
The utility of the compounds in accordance with the present invention as antagonists of metabotropic glutamate receptor activity, in particular mGluR...
US Patent US9636337 (2017)
BindingDB Entry DOI: 10.7270/Q2F191TK