BDBM213197 US9290517, 127
SMILES: Cn1c(N)ncc1-c1ccc(cc1)-c1ccc(cc1)-c1nc2nc(O[C@@H]3CO[C@@H]4[C@H](O)CO[C@H]34)[nH]c2cc1Cl
InChI Key:
Data: 1 EC50
Activity Spreadsheet -- Enzyme Inhibition Constant Data from BindingDB
Found 1 hit for monomerid = 213197
Trg + Lig
Ki
nM
ΔG°
kcal/mole
IC50
nM
Kd
nM
EC50/IC50
nM
koff
s-1
kon
M-1s-1
pHTemp
°C
AMPK alpha2/beta1/gamma1
(Homo sapiens (Human))
BDBM213197
(US9290517, 127)
Show SMILES Cn1c(N)ncc1-c1ccc(cc1)-c1ccc(cc1)-c1nc2nc(O[C@@H]3CO[C@@H]4[C@H](O)CO[C@H]34)[nH]c2cc1Cl |r|
US Patent
n/an/an/an/a 4n/an/a7.3n/a
Merck Sharp & Dohme Corp.
US Patent
Assay Description
The in vitro AMPK activation assay is performed in a volume of 30 μl in a 384-well plate. Enzyme reactions were assembled in the microtiter plat...
US Patent US9290517 (2016)
BindingDB Entry DOI: 10.7270/Q2C24V7Q