BDBM21320 1-[2-(morpholin-4-yl)ethyl]-3-[(2,2,3,3-tetramethylcyclopropyl)carbonyl]-1H-indol-4-amine::Morpholino-ethyl analogue, 41
SMILES: CC1(C)C(C(=O)c2cn(CCN3CCOCC3)c3cccc(N)c23)C1(C)C
InChI Key: InChIKey=XCBYGYHHTWZKKL-UHFFFAOYSA-N
Data: 4 KI  1 EC50
Activity Spreadsheet -- Enzyme Inhibition Constant Data from BindingDB
Found 4 hits for monomerid = 21320
Trg + Lig
Ki
nM
ΔG°
kcal/mole
IC50
nM
Kd
nM
EC50/IC50
nM
koff
s-1
kon
M-1s-1
pHTemp
°C
Cannabinoid receptor 2
(Homo sapiens (Human))
BDBM21320
(1-[2-(morpholin-4-yl)ethyl]-3-[(2,2,3,3-tetramethy...)
Show SMILES CC1(C)C(C(=O)c2cn(CCN3CCOCC3)c3cccc(N)c23)C1(C)C
Show InChI InChI=1S/C22H31N3O2/c1-21(2)20(22(21,3)4)19(26)15-14-25(9-8-24-10-12-27-13-11-24)17-7-5-6-16(23)18(15)17/h5-7,14,20H,8-13,23H2,1-4H3
Reactome pathway
32n/an/an/a 215n/an/an/an/a
Abbott Laboratories
Assay Description
IC50 values for test compounds were determined from nonlinear regression analysis of data collected from ligand binding experiments. The inhibition c...
J Med Chem 51: 1904-12 (2008)
Article DOI: 10.1021/jm7011613
BindingDB Entry DOI: 10.7270/Q2C827K2
Cannabinoid receptor 2
(Homo sapiens (Human))
BDBM21320
(1-[2-(morpholin-4-yl)ethyl]-3-[(2,2,3,3-tetramethy...)
Show SMILES CC1(C)C(C(=O)c2cn(CCN3CCOCC3)c3cccc(N)c23)C1(C)C
Show InChI InChI=1S/C22H31N3O2/c1-21(2)20(22(21,3)4)19(26)15-14-25(9-8-24-10-12-27-13-11-24)17-7-5-6-16(23)18(15)17/h5-7,14,20H,8-13,23H2,1-4H3
Reactome pathway
32n/an/an/an/an/an/an/an/a
Universit£ degli Studi di Siena
Curated by ChEMBL
Assay Description
Displacement of [3H]CP 55940 from human CB2 receptor in cell free system
Eur J Med Chem 46: 547-55 (2011)
Article DOI: 10.1016/j.ejmech.2010.11.034
BindingDB Entry DOI: 10.7270/Q2CF9QCJ
Cannabinoid receptor 1
(Homo sapiens (Human))
BDBM21320
(1-[2-(morpholin-4-yl)ethyl]-3-[(2,2,3,3-tetramethy...)
Show SMILES CC1(C)C(C(=O)c2cn(CCN3CCOCC3)c3cccc(N)c23)C1(C)C
Show InChI InChI=1S/C22H31N3O2/c1-21(2)20(22(21,3)4)19(26)15-14-25(9-8-24-10-12-27-13-11-24)17-7-5-6-16(23)18(15)17/h5-7,14,20H,8-13,23H2,1-4H3
NCI pathway
Reactome pathway
3.50E+3n/an/an/an/an/an/an/an/a
Universit£ degli Studi di Siena
Curated by ChEMBL
Assay Description
Displacement of [3H]CP 55940 from human CB1 receptor in cell free system
Eur J Med Chem 46: 547-55 (2011)
Article DOI: 10.1016/j.ejmech.2010.11.034
BindingDB Entry DOI: 10.7270/Q2CF9QCJ
Cannabinoid receptor 1
(Homo sapiens (Human))
BDBM21320
(1-[2-(morpholin-4-yl)ethyl]-3-[(2,2,3,3-tetramethy...)
Show SMILES CC1(C)C(C(=O)c2cn(CCN3CCOCC3)c3cccc(N)c23)C1(C)C
Show InChI InChI=1S/C22H31N3O2/c1-21(2)20(22(21,3)4)19(26)15-14-25(9-8-24-10-12-27-13-11-24)17-7-5-6-16(23)18(15)17/h5-7,14,20H,8-13,23H2,1-4H3
NCI pathway
Reactome pathway
>3.50E+3n/an/an/an/an/an/an/an/a
Abbott Laboratories
Assay Description
IC50 values for test compounds were determined from nonlinear regression analysis of data collected from ligand binding experiments. The inhibition c...
J Med Chem 51: 1904-12 (2008)
Article DOI: 10.1021/jm7011613
BindingDB Entry DOI: 10.7270/Q2C827K2