BDBM213201 US9290517, 131
SMILES: Cc1cc(-c2ccc(cc2)-c2ccc(cc2)-c2nc3nc(O[C@@H]4CO[C@@H]5[C@H](O)CO[C@H]45)[nH]c3cc2Cl)c(=O)[nH]n1
InChI Key: InChIKey=AEVQBBDRFREYSM-CWNOGFBWSA-N
Data: 1 EC50
Activity Spreadsheet -- Enzyme Inhibition Constant Data from BindingDB
Found 1 hit for monomerid = 213201
Trg + Lig
Ki
nM
ΔG°
kcal/mole
IC50
nM
Kd
nM
EC50/IC50
nM
koff
s-1
kon
M-1s-1
pHTemp
°C
AMPK alpha2/beta1/gamma1
(Homo sapiens (Human))
BDBM213201
(US9290517, 131)
Show SMILES Cc1cc(-c2ccc(cc2)-c2ccc(cc2)-c2nc3nc(O[C@@H]4CO[C@@H]5[C@H](O)CO[C@H]45)[nH]c3cc2Cl)c(=O)[nH]n1 |r|
Show InChI InChI=1S/C29H22ClN5O5/c1-14-10-19(28(37)35-34-14)17-6-2-15(3-7-17)16-4-8-18(9-5-16)24-20(30)11-21-27(32-24)33-29(31-21)40-23-13-39-25-22(36)12-38-26(23)25/h2-11,22-23,25-26,36H,12-13H2,1H3/b16-15-,19-17-,24-18+/t22-,23-,25-,26-/m1/s1
US Patent
n/an/an/an/a 3n/an/a7.3n/a
Merck Sharp & Dohme Corp.
US Patent
Assay Description
The in vitro AMPK activation assay is performed in a volume of 30 μl in a 384-well plate. Enzyme reactions were assembled in the microtiter plat...
US Patent US9290517 (2016)
BindingDB Entry DOI: 10.7270/Q2C24V7Q