null
SMILES: O[C@@H]1CO[C@@H]2[C@@H](CO[C@H]12)Oc1nc2nc(c(Cl)cc2[nH]1)-c1ccc(cc1)-c1ccc(cc1)-n1ccc(=O)[nH]1
InChI Key:
Activity Spreadsheet -- Enzyme Inhibition Constant Data from BindingDB
Found 1 hit for monomerid = 213209
Trg + Lig
Ki
nM
ΔG°
kcal/mole
IC50
nM
Kd
nM
EC50/IC50
nM
koff
s-1
kon
M-1s-1
pHTemp
°C
5'-AMP-activated protein kinase catalytic subunit alpha-2/subunit beta-1/subunit gamma-1
(Homo sapiens (Human))
BDBM213209
(US9290517, 150)
Show SMILES O[C@@H]1CO[C@@H]2[C@@H](CO[C@H]12)Oc1nc2nc(c(Cl)cc2[nH]1)-c1ccc(cc1)-c1ccc(cc1)-n1ccc(=O)[nH]1 |r|
US Patent
n/an/an/an/a 1n/an/a7.3n/a
Merck Sharp & Dohme Corp.
US Patent
Assay Description
The in vitro AMPK activation assay is performed in a volume of 30 μl in a 384-well plate. Enzyme reactions were assembled in the microtiter plat...
US Patent US9290517 (2016)
BindingDB Entry DOI: 10.7270/Q2C24V7Q