BDBM213223 1-((S)-3-((4-((((R)-3,3-Dimethylbutan-2-yl)amino)methyl)-6-(thiazolo[5,4-b]pyridin-2-ylamino)pyridin-2-yl)amino)pyrrolidin-1-yl)prop-2-en-1-one (13)
SMILES: C[C@@H](NCc1cc(N[C@H]2CCN(C2)C(=O)C=C)nc(Nc2nc3cccnc3s2)c1)C(C)(C)C
InChI Key: InChIKey=XHVGFIQVBRHURI-AEFFLSMTSA-N
Data: 1 IC50
Activity Spreadsheet -- Enzyme Inhibition Constant Data from BindingDB
Found 1 hit for monomerid = 213223
Trg + Lig
Ki
nM
ΔG°
kcal/mole
IC50
nM
Kd
nM
EC50/IC50
nM
koff
s-1
kon
M-1s-1
pHTemp
°C
Interlukin-2-inducible tyrosine kinase (Itk)
(Homo sapiens (Human))
BDBM213223
(1-((S)-3-((4-((((R)-3,3-Dimethylbutan-2-yl)amino)m...)
Show SMILES C[C@@H](NCc1cc(N[C@H]2CCN(C2)C(=O)C=C)nc(Nc2nc3cccnc3s2)c1)C(C)(C)C |r|
Show InChI InChI=1S/C25H33N7OS/c1-6-22(33)32-11-9-18(15-32)28-20-12-17(14-27-16(2)25(3,4)5)13-21(30-20)31-24-29-19-8-7-10-26-23(19)34-24/h6-8,10,12-13,16,18,27H,1,9,11,14-15H2,2-5H3,(H2,28,29,30,31)/t16-,18+/m1/s1
n/an/a 7.90n/an/an/an/an/an/a
GlaxoSmithKline
Assay Description
This assay is based on the binding and displacement of Alexa-fluor 647-labeled ATP-competitive kinase inhibitor tracer 236. Binding of the tracer is ...
J Biol Chem 288: 28195-206 (2013)
Article DOI: 10.1074/jbc.M113.474114
BindingDB Entry DOI: 10.7270/Q2ZW1JSK