BDBM21324 5-(4-bromobutoxy)-1-(oxan-4-ylmethyl)-3-[(2,2,3,3-tetramethylcyclopropyl)carbonyl]-1H-indole::Tetrahydropyranyl-methyl analogue, 45
SMILES: CC1(C)C(C(=O)c2cn(CC3CCOCC3)c3ccc(OCCCCBr)cc23)C1(C)C
InChI Key: InChIKey=OGLYPVVVWXXRJW-UHFFFAOYSA-N
Data: 2 KI  1 EC50
Activity Spreadsheet -- Enzyme Inhibition Constant Data from BindingDB
Found 2 hits for monomerid = 21324
Trg + Lig
Ki
nM
ΔG°
kcal/mole
IC50
nM
Kd
nM
EC50/IC50
nM
koff
s-1
kon
M-1s-1
pHTemp
°C
Cannabinoid receptor 2
(Homo sapiens (Human))
BDBM21324
(5-(4-bromobutoxy)-1-(oxan-4-ylmethyl)-3-[(2,2,3,3-...)
Show SMILES CC1(C)C(C(=O)c2cn(CC3CCOCC3)c3ccc(OCCCCBr)cc23)C1(C)C
Show InChI InChI=1S/C26H36BrNO3/c1-25(2)24(26(25,3)4)23(29)21-17-28(16-18-9-13-30-14-10-18)22-8-7-19(15-20(21)22)31-12-6-5-11-27/h7-8,15,17-18,24H,5-6,9-14,16H2,1-4H3
Reactome pathway
72n/an/an/a>1.00E+4n/an/an/an/a
Abbott Laboratories
Assay Description
IC50 values for test compounds were determined from nonlinear regression analysis of data collected from ligand binding experiments. The inhibition c...
J Med Chem 51: 1904-12 (2008)
Article DOI: 10.1021/jm7011613
BindingDB Entry DOI: 10.7270/Q2C827K2
Cannabinoid receptor 1
(Homo sapiens (Human))
BDBM21324
(5-(4-bromobutoxy)-1-(oxan-4-ylmethyl)-3-[(2,2,3,3-...)
Show SMILES CC1(C)C(C(=O)c2cn(CC3CCOCC3)c3ccc(OCCCCBr)cc23)C1(C)C
Show InChI InChI=1S/C26H36BrNO3/c1-25(2)24(26(25,3)4)23(29)21-17-28(16-18-9-13-30-14-10-18)22-8-7-19(15-20(21)22)31-12-6-5-11-27/h7-8,15,17-18,24H,5-6,9-14,16H2,1-4H3
NCI pathway
Reactome pathway
>1.00E+4n/an/an/an/an/an/an/an/a
Abbott Laboratories
Assay Description
IC50 values for test compounds were determined from nonlinear regression analysis of data collected from ligand binding experiments. The inhibition c...
J Med Chem 51: 1904-12 (2008)
Article DOI: 10.1021/jm7011613
BindingDB Entry DOI: 10.7270/Q2C827K2