BDBM21325 1-(oxan-4-ylmethyl)-3-[(2,2,3,3-tetramethylcyclopropyl)carbonyl]-1H-indole-5-carbonitrile::Tetrahydropyranyl-methyl analogue, 46
SMILES: CC1(C)C(C(=O)c2cn(CC3CCOCC3)c3ccc(cc23)C#N)C1(C)C
InChI Key: InChIKey=ZZTPACIJHCBASD-UHFFFAOYSA-N
Data: 4 KI  1 EC50
Activity Spreadsheet -- Enzyme Inhibition Constant Data from BindingDB
Found 4 hits for monomerid = 21325
Trg + Lig
Ki
nM
ΔG°
kcal/mole
IC50
nM
Kd
nM
EC50/IC50
nM
koff
s-1
kon
M-1s-1
pHTemp
°C
Cannabinoid receptor 2
(Homo sapiens (Human))
BDBM21325
(1-(oxan-4-ylmethyl)-3-[(2,2,3,3-tetramethylcyclopr...)
Show SMILES CC1(C)C(C(=O)c2cn(CC3CCOCC3)c3ccc(cc23)C#N)C1(C)C
Show InChI InChI=1S/C23H28N2O2/c1-22(2)21(23(22,3)4)20(26)18-14-25(13-15-7-9-27-10-8-15)19-6-5-16(12-24)11-17(18)19/h5-6,11,14-15,21H,7-10,13H2,1-4H3
Reactome pathway
30n/an/an/a 263n/an/an/an/a
Abbott Laboratories
Assay Description
IC50 values for test compounds were determined from nonlinear regression analysis of data collected from ligand binding experiments. The inhibition c...
J Med Chem 51: 1904-12 (2008)
Article DOI: 10.1021/jm7011613
BindingDB Entry DOI: 10.7270/Q2C827K2
Cannabinoid receptor 2
(Homo sapiens (Human))
BDBM21325
(1-(oxan-4-ylmethyl)-3-[(2,2,3,3-tetramethylcyclopr...)
Show SMILES CC1(C)C(C(=O)c2cn(CC3CCOCC3)c3ccc(cc23)C#N)C1(C)C
Show InChI InChI=1S/C23H28N2O2/c1-22(2)21(23(22,3)4)20(26)18-14-25(13-15-7-9-27-10-8-15)19-6-5-16(12-24)11-17(18)19/h5-6,11,14-15,21H,7-10,13H2,1-4H3
Reactome pathway
30n/an/an/an/an/an/an/an/a
Universit£ degli Studi di Siena
Curated by ChEMBL
Assay Description
Displacement of [3H]CP 55940 from human CB2 receptor in cell free system
Eur J Med Chem 46: 547-55 (2011)
Article DOI: 10.1016/j.ejmech.2010.11.034
BindingDB Entry DOI: 10.7270/Q2CF9QCJ
Cannabinoid receptor 1
(Homo sapiens (Human))
BDBM21325
(1-(oxan-4-ylmethyl)-3-[(2,2,3,3-tetramethylcyclopr...)
Show SMILES CC1(C)C(C(=O)c2cn(CC3CCOCC3)c3ccc(cc23)C#N)C1(C)C
Show InChI InChI=1S/C23H28N2O2/c1-22(2)21(23(22,3)4)20(26)18-14-25(13-15-7-9-27-10-8-15)19-6-5-16(12-24)11-17(18)19/h5-6,11,14-15,21H,7-10,13H2,1-4H3
NCI pathway
Reactome pathway
3.31E+3n/an/an/an/an/an/an/an/a
Universit£ degli Studi di Siena
Curated by ChEMBL
Assay Description
Displacement of [3H]CP 55940 from human CB1 receptor in cell free system
Eur J Med Chem 46: 547-55 (2011)
Article DOI: 10.1016/j.ejmech.2010.11.034
BindingDB Entry DOI: 10.7270/Q2CF9QCJ
Cannabinoid receptor 1
(Homo sapiens (Human))
BDBM21325
(1-(oxan-4-ylmethyl)-3-[(2,2,3,3-tetramethylcyclopr...)
Show SMILES CC1(C)C(C(=O)c2cn(CC3CCOCC3)c3ccc(cc23)C#N)C1(C)C
Show InChI InChI=1S/C23H28N2O2/c1-22(2)21(23(22,3)4)20(26)18-14-25(13-15-7-9-27-10-8-15)19-6-5-16(12-24)11-17(18)19/h5-6,11,14-15,21H,7-10,13H2,1-4H3
NCI pathway
Reactome pathway
3.33E+3n/an/an/an/an/an/an/an/a
Abbott Laboratories
Assay Description
IC50 values for test compounds were determined from nonlinear regression analysis of data collected from ligand binding experiments. The inhibition c...
J Med Chem 51: 1904-12 (2008)
Article DOI: 10.1021/jm7011613
BindingDB Entry DOI: 10.7270/Q2C827K2