BDBM2133 3-[2-(2-cyano-6-fluoro-3-methoxyphenyl)ethyl]-1-(5-cyanopyridin-2-yl)thiourea::LY300046HCl Analog 18::N-[2-(2-Cyano-6-fluoro-3-methoxyphenethyl)]-N-[2-(5-cyanopyridyl)]thiourea::PETT deriv.
SMILES: COc1ccc(F)c(CCNC(=S)Nc2ccc(cn2)C#N)c1C#N
InChI Key: InChIKey=XERIEOGWOGJQKP-UHFFFAOYSA-N
Data: 3 IC50
Activity Spreadsheet -- Enzyme Inhibition Constant Data from BindingDB
Found 3 hits for monomerid = 2133
Trg + Lig
Ki
nM
ΔG°
kcal/mole
IC50
nM
Kd
nM
EC50/IC50
nM
koff
s-1
kon
M-1s-1
pHTemp
°C
HIV-1 Reverse Transcriptase
(Human immunodeficiency virus type 1)
BDBM2133
(3-[2-(2-cyano-6-fluoro-3-methoxyphenyl)ethyl]-1-(5...)
Show SMILES COc1ccc(F)c(CCNC(=S)Nc2ccc(cn2)C#N)c1C#N
Show InChI InChI=1S/C17H14FN5OS/c1-24-15-4-3-14(18)12(13(15)9-20)6-7-21-17(25)23-16-5-2-11(8-19)10-22-16/h2-5,10H,6-7H2,1H3,(H2,21,22,23,25)
n/an/a 3n/an/an/an/an/an/a
Lilly Research Laboratories
Assay Description
The IC50 of reverse transcriptase is the concentration that inhibits 50% of recombinant HIV-1 RT RNA-directed DNA polymerase activity in vitro.
J Med Chem 39: 4261-74 (1996)
Article DOI: 10.1021/jm950639r
BindingDB Entry DOI: 10.7270/Q2542KSN
HIV-1 Reverse Transcriptase Mutant (Y181C)
(Human immunodeficiency virus type 1)
BDBM2133
(3-[2-(2-cyano-6-fluoro-3-methoxyphenyl)ethyl]-1-(5...)
Show SMILES COc1ccc(F)c(CCNC(=S)Nc2ccc(cn2)C#N)c1C#N
Show InChI InChI=1S/C17H14FN5OS/c1-24-15-4-3-14(18)12(13(15)9-20)6-7-21-17(25)23-16-5-2-11(8-19)10-22-16/h2-5,10H,6-7H2,1H3,(H2,21,22,23,25)
n/an/a 50n/an/an/an/an/an/a
Lilly Research Laboratories
Assay Description
The IC50 of reverse transcriptase is the concentration that inhibits 50% of recombinant HIV-1 RT RNA-directed DNA polymerase activity in vitro.
J Med Chem 39: 4261-74 (1996)
Article DOI: 10.1021/jm950639r
BindingDB Entry DOI: 10.7270/Q2542KSN
HIV-1 Reverse Transcriptase Mutant (L100I)
(Human immunodeficiency virus type 1)
BDBM2133
(3-[2-(2-cyano-6-fluoro-3-methoxyphenyl)ethyl]-1-(5...)
Show SMILES COc1ccc(F)c(CCNC(=S)Nc2ccc(cn2)C#N)c1C#N
Show InChI InChI=1S/C17H14FN5OS/c1-24-15-4-3-14(18)12(13(15)9-20)6-7-21-17(25)23-16-5-2-11(8-19)10-22-16/h2-5,10H,6-7H2,1H3,(H2,21,22,23,25)
n/an/a 60n/an/an/an/an/an/a
Lilly Research Laboratories
Assay Description
The IC50 of reverse transcriptase is the concentration that inhibits 50% of recombinant HIV-1 RT RNA-directed DNA polymerase activity in vitro.
J Med Chem 39: 4261-74 (1996)
Article DOI: 10.1021/jm950639r
BindingDB Entry DOI: 10.7270/Q2542KSN