BDBM213613 US9278981, 205
SMILES: O[C@@H]1CCN(C1)c1ncc(cc1-c1cncnc1)C(=O)Nc1ccc(SC(F)(F)F)c(F)c1
InChI Key: InChIKey=CXNJUTQWZIVOQW-OAHLLOKOSA-N
Data: 2 IC50
Activity Spreadsheet -- Enzyme Inhibition Constant Data from BindingDB
Found 2 hits for monomerid = 213613
Trg + Lig
Ki
nM
ΔG°
kcal/mole
IC50
nM
Kd
nM
EC50/IC50
nM
koff
s-1
kon
M-1s-1
pHTemp
°C
Tyrosine-protein kinase ABL1
(Homo sapiens (Human))
BDBM213613
(US9278981, 205)
Show SMILES O[C@@H]1CCN(C1)c1ncc(cc1-c1cncnc1)C(=O)Nc1ccc(SC(F)(F)F)c(F)c1 |r|
Show InChI InChI=1S/C21H17F4N5O2S/c22-17-6-14(1-2-18(17)33-21(23,24)25)29-20(32)12-5-16(13-7-26-11-27-8-13)19(28-9-12)30-4-3-15(31)10-30/h1-2,5-9,11,15,31H,3-4,10H2,(H,29,32)/t15-/m1/s1
US Patent
n/an/a<0.130n/an/an/an/a7.530
Novartis AG
US Patent
Assay Description
The assay plates were prepared by addition of 50 nL per well of compound solution in 90% DMSO. The kinase reactions were started by stepwise addition...
US Patent US9278981 (2016)
BindingDB Entry DOI: 10.7270/Q2DV1HRD
Tyrosine-protein kinase ABL1
(Homo sapiens (Human))
BDBM213613
(US9278981, 205)
Show SMILES O[C@@H]1CCN(C1)c1ncc(cc1-c1cncnc1)C(=O)Nc1ccc(SC(F)(F)F)c(F)c1 |r|
Show InChI InChI=1S/C21H17F4N5O2S/c22-17-6-14(1-2-18(17)33-21(23,24)25)29-20(32)12-5-16(13-7-26-11-27-8-13)19(28-9-12)30-4-3-15(31)10-30/h1-2,5-9,11,15,31H,3-4,10H2,(H,29,32)/t15-/m1/s1
US Patent
n/an/a<3n/an/an/an/a7.525
Novartis AG
US Patent
Assay Description
For determination of ABL kinase activity, the radiometric filter-binding assay was used. The assay was performed by mixing 10 uL of the compound pre-...
US Patent US9278981 (2016)
BindingDB Entry DOI: 10.7270/Q2DV1HRD