null
SMILES: CCc1cccc2cc(oc12)C(O)CNC(C)(C)C
InChI Key: InChIKey=SSEBTPPFLLCUMN-UHFFFAOYSA-N
Activity Spreadsheet -- Enzyme Inhibition Constant Data from BindingDB
Found 1 hit for monomerid = 21362
Trg + Lig
Ki
nM
ΔG°
kcal/mole
IC50
nM
Kd
nM
EC50/IC50
nM
koff
s-1
kon
M-1s-1
pHTemp
°C
Cytochrome P450 2J2
(Homo sapiens (Human))
BDBM21362
(2-(tert-butylamino)-1-(7-ethyl-1-benzofuran-2-yl)e...)
Show SMILES CCc1cccc2cc(oc12)C(O)CNC(C)(C)C
Show InChI InChI=1S/C16H23NO2/c1-5-11-7-6-8-12-9-14(19-15(11)12)13(18)10-17-16(2,3)4/h6-9,13,17-18H,5,10H2,1-4H3
n/an/a>5.00E+4n/an/an/an/an/an/a
Tongji University
Curated by ChEMBL
Assay Description
Inhibition of human recombinant CYP2J2 assessed as reduction in astemizole O-demethylation by LC-MS/MS method
Drug Metab Dispos 41: 60-71 (2012)
Article DOI: 10.1124/dmd.112.048264
BindingDB Entry DOI: 10.7270/Q2K0761G