BDBM21373 6-[4-(2-nitrophenyl)piperazin-1-yl]-N-(1,2,3,4-tetrahydronaphthalen-1-yl)hexanamide::CHEMBL225571::Piperazinehexanamide derivative, 11
SMILES: [O-][N+](=O)c1ccccc1N1CCN(CCCCCC(=O)NC2CCCc3ccccc23)CC1
InChI Key: InChIKey=ZBUOQRCOVPVZEE-UHFFFAOYSA-N
Data: 7 KI
Activity Spreadsheet -- Enzyme Inhibition Constant Data from BindingDB
Found 7 hits for monomerid = 21373
Trg + Lig
Ki
nM
ΔG°
kcal/mole
IC50
nM
Kd
nM
EC50/IC50
nM
koff
s-1
kon
M-1s-1
pHTemp
°C
Serotonin (5-HT) receptor
(Rattus norvegicus (rat))
BDBM21373
(6-[4-(2-nitrophenyl)piperazin-1-yl]-N-(1,2,3,4-tet...)
Show SMILES [O-][N+](=O)c1ccccc1N1CCN(CCCCCC(=O)NC2CCCc3ccccc23)CC1
Show InChI InChI=1S/C26H34N4O3/c31-26(27-23-12-8-10-21-9-3-4-11-22(21)23)15-2-1-7-16-28-17-19-29(20-18-28)24-13-5-6-14-25(24)30(32)33/h3-6,9,11,13-14,23H,1-2,7-8,10,12,15-20H2,(H,27,31)
Reactome pathway
63.3 -10.2n/an/an/an/an/a7.437
Universita degli Studi di Bari
Assay Description
IC50 values for each test compound were determined from nonlinear regression analysis of data collected from ligand binding experiments. The inhibiti...
J Med Chem 50: 4214-21 (2007)
Article DOI: 10.1021/jm070487n
BindingDB Entry DOI: 10.7270/Q20000CJ
Serotonin (5-HT) receptor
(Rattus norvegicus (rat))
BDBM21373
(6-[4-(2-nitrophenyl)piperazin-1-yl]-N-(1,2,3,4-tet...)
Show SMILES [O-][N+](=O)c1ccccc1N1CCN(CCCCCC(=O)NC2CCCc3ccccc23)CC1
Show InChI InChI=1S/C26H34N4O3/c31-26(27-23-12-8-10-21-9-3-4-11-22(21)23)15-2-1-7-16-28-17-19-29(20-18-28)24-13-5-6-14-25(24)30(32)33/h3-6,9,11,13-14,23H,1-2,7-8,10,12,15-20H2,(H,27,31)
Reactome pathway
63.3n/an/an/an/an/an/an/an/a
Università degli Studi di Bari
Curated by ChEMBL
Assay Description
Displacement of [3H]LSD from rat recombinant 5HT7 receptor expressed in HEK293 cells
J Med Chem 47: 6616-24 (2004)
Article DOI: 10.1021/jm049702f
BindingDB Entry DOI: 10.7270/Q2RX9BKX
5-hydroxytryptamine receptor 1A
(Homo sapiens (Human))
BDBM21373
(6-[4-(2-nitrophenyl)piperazin-1-yl]-N-(1,2,3,4-tet...)
Show SMILES [O-][N+](=O)c1ccccc1N1CCN(CCCCCC(=O)NC2CCCc3ccccc23)CC1
Show InChI InChI=1S/C26H34N4O3/c31-26(27-23-12-8-10-21-9-3-4-11-22(21)23)15-2-1-7-16-28-17-19-29(20-18-28)24-13-5-6-14-25(24)30(32)33/h3-6,9,11,13-14,23H,1-2,7-8,10,12,15-20H2,(H,27,31)
183n/an/an/an/an/an/an/an/a
Universita degli Studi di Bari
Assay Description
IC50 values for each test compound were determined from nonlinear regression analysis of data collected from ligand binding experiments. The inhibiti...
J Med Chem 50: 4214-21 (2007)
Article DOI: 10.1021/jm070487n
BindingDB Entry DOI: 10.7270/Q20000CJ
5-hydroxytryptamine receptor 1A
(Rattus norvegicus (rat))
BDBM21373
(6-[4-(2-nitrophenyl)piperazin-1-yl]-N-(1,2,3,4-tet...)
Show SMILES [O-][N+](=O)c1ccccc1N1CCN(CCCCCC(=O)NC2CCCc3ccccc23)CC1
Show InChI InChI=1S/C26H34N4O3/c31-26(27-23-12-8-10-21-9-3-4-11-22(21)23)15-2-1-7-16-28-17-19-29(20-18-28)24-13-5-6-14-25(24)30(32)33/h3-6,9,11,13-14,23H,1-2,7-8,10,12,15-20H2,(H,27,31)
183n/an/an/an/an/an/an/an/a
Università degli Studi di Bari
Curated by ChEMBL
Assay Description
Displacement of [3H]8-OH-DPAT from 5HT1A receptor in Wistar Han rat hippocampal membranes
J Med Chem 47: 6616-24 (2004)
Article DOI: 10.1021/jm049702f
BindingDB Entry DOI: 10.7270/Q2RX9BKX
5-hydroxytryptamine receptor 2A
(Rattus norvegicus (rat))
BDBM21373
(6-[4-(2-nitrophenyl)piperazin-1-yl]-N-(1,2,3,4-tet...)
Show SMILES [O-][N+](=O)c1ccccc1N1CCN(CCCCCC(=O)NC2CCCc3ccccc23)CC1
Show InChI InChI=1S/C26H34N4O3/c31-26(27-23-12-8-10-21-9-3-4-11-22(21)23)15-2-1-7-16-28-17-19-29(20-18-28)24-13-5-6-14-25(24)30(32)33/h3-6,9,11,13-14,23H,1-2,7-8,10,12,15-20H2,(H,27,31)
Reactome pathway
282n/an/an/an/an/an/an/an/a
Universita degli Studi di Bari
Assay Description
IC50 values for each test compound were determined from nonlinear regression analysis of data collected from ligand binding experiments. The inhibiti...
J Med Chem 50: 4214-21 (2007)
Article DOI: 10.1021/jm070487n
BindingDB Entry DOI: 10.7270/Q20000CJ
5-hydroxytryptamine receptor 2A
(Rattus norvegicus (rat))
BDBM21373
(6-[4-(2-nitrophenyl)piperazin-1-yl]-N-(1,2,3,4-tet...)
Show SMILES [O-][N+](=O)c1ccccc1N1CCN(CCCCCC(=O)NC2CCCc3ccccc23)CC1
Show InChI InChI=1S/C26H34N4O3/c31-26(27-23-12-8-10-21-9-3-4-11-22(21)23)15-2-1-7-16-28-17-19-29(20-18-28)24-13-5-6-14-25(24)30(32)33/h3-6,9,11,13-14,23H,1-2,7-8,10,12,15-20H2,(H,27,31)
Reactome pathway
282n/an/an/an/an/an/an/an/a
Università degli Studi di Bari
Curated by ChEMBL
Assay Description
Displacement of [3H]ketanserin from 5HT2A receptor in Wistar Han rat cortex membranes
J Med Chem 47: 6616-24 (2004)
Article DOI: 10.1021/jm049702f
BindingDB Entry DOI: 10.7270/Q2RX9BKX
D(2) dopamine receptor
(Homo sapiens (Human))
BDBM21373
(6-[4-(2-nitrophenyl)piperazin-1-yl]-N-(1,2,3,4-tet...)
Show SMILES [O-][N+](=O)c1ccccc1N1CCN(CCCCCC(=O)NC2CCCc3ccccc23)CC1
Show InChI InChI=1S/C26H34N4O3/c31-26(27-23-12-8-10-21-9-3-4-11-22(21)23)15-2-1-7-16-28-17-19-29(20-18-28)24-13-5-6-14-25(24)30(32)33/h3-6,9,11,13-14,23H,1-2,7-8,10,12,15-20H2,(H,27,31)
Reactome pathway
681n/an/an/an/an/an/an/an/a
Universita degli Studi di Bari
Assay Description
IC50 values for each test compound were determined from nonlinear regression analysis of data collected from ligand binding experiments. The inhibiti...
J Med Chem 50: 4214-21 (2007)
Article DOI: 10.1021/jm070487n
BindingDB Entry DOI: 10.7270/Q20000CJ