BDBM21390 6-[4-(pyridin-2-yl)piperazin-1-yl]-N-(1,2,3,4-tetrahydronaphthalen-1-yl)hexanamide::Piperazinehexanamide derivative, 28
SMILES: O=C(CCCCCN1CCN(CC1)c1ccccn1)NC1CCCc2ccccc12
InChI Key: InChIKey=XJYAXSYLDGSUII-UHFFFAOYSA-N
Data: 4 KI
Activity Spreadsheet -- Enzyme Inhibition Constant Data from BindingDB
Found 4 hits for monomerid = 21390
Trg + Lig
Ki
nM
ΔG°
kcal/mole
IC50
nM
Kd
nM
EC50/IC50
nM
koff
s-1
kon
M-1s-1
pHTemp
°C
5-hydroxytryptamine receptor 1A
(Homo sapiens (Human))
BDBM21390
(6-[4-(pyridin-2-yl)piperazin-1-yl]-N-(1,2,3,4-tetr...)
Show SMILES O=C(CCCCCN1CCN(CC1)c1ccccn1)NC1CCCc2ccccc12
Show InChI InChI=1S/C25H34N4O/c30-25(27-23-12-8-10-21-9-3-4-11-22(21)23)14-2-1-7-16-28-17-19-29(20-18-28)24-13-5-6-15-26-24/h3-6,9,11,13,15,23H,1-2,7-8,10,12,14,16-20H2,(H,27,30)
36.4n/an/an/an/an/an/an/an/a
Universita degli Studi di Bari
Assay Description
IC50 values for each test compound were determined from nonlinear regression analysis of data collected from ligand binding experiments. The inhibiti...
J Med Chem 50: 4214-21 (2007)
Article DOI: 10.1021/jm070487n
BindingDB Entry DOI: 10.7270/Q20000CJ
Serotonin (5-HT) receptor
(Rattus norvegicus (rat))
BDBM21390
(6-[4-(pyridin-2-yl)piperazin-1-yl]-N-(1,2,3,4-tetr...)
Show SMILES O=C(CCCCCN1CCN(CC1)c1ccccn1)NC1CCCc2ccccc12
Show InChI InChI=1S/C25H34N4O/c30-25(27-23-12-8-10-21-9-3-4-11-22(21)23)14-2-1-7-16-28-17-19-29(20-18-28)24-13-5-6-15-26-24/h3-6,9,11,13,15,23H,1-2,7-8,10,12,14,16-20H2,(H,27,30)
Reactome pathway
278 -9.30n/an/an/an/an/a7.437
Universita degli Studi di Bari
Assay Description
IC50 values for each test compound were determined from nonlinear regression analysis of data collected from ligand binding experiments. The inhibiti...
J Med Chem 50: 4214-21 (2007)
Article DOI: 10.1021/jm070487n
BindingDB Entry DOI: 10.7270/Q20000CJ
5-hydroxytryptamine receptor 2A
(Rattus norvegicus (rat))
BDBM21390
(6-[4-(pyridin-2-yl)piperazin-1-yl]-N-(1,2,3,4-tetr...)
Show SMILES O=C(CCCCCN1CCN(CC1)c1ccccn1)NC1CCCc2ccccc12
Show InChI InChI=1S/C25H34N4O/c30-25(27-23-12-8-10-21-9-3-4-11-22(21)23)14-2-1-7-16-28-17-19-29(20-18-28)24-13-5-6-15-26-24/h3-6,9,11,13,15,23H,1-2,7-8,10,12,14,16-20H2,(H,27,30)
Reactome pathway
535n/an/an/an/an/an/an/an/a
Universita degli Studi di Bari
Assay Description
IC50 values for each test compound were determined from nonlinear regression analysis of data collected from ligand binding experiments. The inhibiti...
J Med Chem 50: 4214-21 (2007)
Article DOI: 10.1021/jm070487n
BindingDB Entry DOI: 10.7270/Q20000CJ
D(2) dopamine receptor
(Homo sapiens (Human))
BDBM21390
(6-[4-(pyridin-2-yl)piperazin-1-yl]-N-(1,2,3,4-tetr...)
Show SMILES O=C(CCCCCN1CCN(CC1)c1ccccn1)NC1CCCc2ccccc12
Show InChI InChI=1S/C25H34N4O/c30-25(27-23-12-8-10-21-9-3-4-11-22(21)23)14-2-1-7-16-28-17-19-29(20-18-28)24-13-5-6-15-26-24/h3-6,9,11,13,15,23H,1-2,7-8,10,12,14,16-20H2,(H,27,30)
Reactome pathway
>1.00E+3n/an/an/an/an/an/an/an/a
Universita degli Studi di Bari
Assay Description
IC50 values for each test compound were determined from nonlinear regression analysis of data collected from ligand binding experiments. The inhibiti...
J Med Chem 50: 4214-21 (2007)
Article DOI: 10.1021/jm070487n
BindingDB Entry DOI: 10.7270/Q20000CJ