BDBM214537 US9283222, 657
SMILES: Fc1ccc(Cc2n[nH]c(=O)c3CCCNc23)cc1C(=O)N1CCN(CC1)C(=O)c1cnc2ccccc2c1
InChI Key: InChIKey=OWCKFGBXLCCFAE-UHFFFAOYSA-N
Data: 1 KI
Activity Spreadsheet -- Enzyme Inhibition Constant Data from BindingDB
Found 1 hit for monomerid = 214537
Trg + Lig
Ki
nM
ΔG°
kcal/mole
IC50
nM
Kd
nM
EC50/IC50
nM
koff
s-1
kon
M-1s-1
pHTemp
°C
Poly [ADP-ribose] polymerase 1
(Homo sapiens (Human))
BDBM214537
(US9283222, 657)
Show SMILES Fc1ccc(Cc2n[nH]c(=O)c3CCCNc23)cc1C(=O)N1CCN(CC1)C(=O)c1cnc2ccccc2c1
Show InChI InChI=1S/C29H27FN6O3/c30-23-8-7-18(15-25-26-21(5-3-9-31-26)27(37)34-33-25)14-22(23)29(39)36-12-10-35(11-13-36)28(38)20-16-19-4-1-2-6-24(19)32-17-20/h1-2,4,6-8,14,16-17,31H,3,5,9-13,15H2,(H,34,37)
US Patent
0.800n/an/an/an/an/an/a8.0n/a
AbbVie Inc.
US Patent
Assay Description
PARP1 assay was conducted in PARP assay buffer containing 50 mM Tris pH 8.0, 1 mM DTT, 4 mM MgCl2. PARP reactions contained 1.5 uM [3H]-NAD+ (1.6 uCi...
US Patent US9283222 (2016)
BindingDB Entry DOI: 10.7270/Q2BZ64XD