null
SMILES: COc1cc(ccc1\C=C(/C#N)C(O)=O)N1CCCC1
InChI Key: InChIKey=JIYZMSFJSKOOBF-XYOKQWHBSA-N
Activity Spreadsheet -- Enzyme Inhibition Constant Data from BindingDB
Found 1 hit for monomerid = 214698
Trg + Lig
Ki
nM
ΔG°
kcal/mole
IC50
nM
Kd
nM
EC50/IC50
nM
koff
s-1
kon
M-1s-1
pHTemp
°C
Monocarboxylate transporter 1
(Rattus norvegicus (Rat))
BDBM214698
(US9296728, 21)
Show SMILES COc1cc(ccc1\C=C(/C#N)C(O)=O)N1CCCC1
Show InChI InChI=1S/C15H16N2O3/c1-20-14-9-13(17-6-2-3-7-17)5-4-11(14)8-12(10-16)15(18)19/h4-5,8-9H,2-3,6-7H2,1H3,(H,18,19)/b12-8+
US Patent
n/an/a 59n/an/an/an/a7.4337
Regents of the University of Minnesota
US Patent
Assay Description
The entire lactate uptake studies for the inhibition of MCT1 were carried out on RBE4 (Rat Brain Endothelial 4) cells. The expression of MCT1 on thes...
US Patent US9296728 (2016)
BindingDB Entry DOI: 10.7270/Q2KH0M5R