BDBM214700 US9296728, 23
SMILES: OC(=O)c1cc2ccc(cc2oc1=O)N(CC=C)CC=C
InChI Key: InChIKey=CNKJPGDJYDBWCI-UHFFFAOYSA-N
Data: 2 IC50
Activity Spreadsheet -- Enzyme Inhibition Constant Data from BindingDB
Found 2 hits for monomerid = 214700
Trg + Lig
Ki
nM
ΔG°
kcal/mole
IC50
nM
Kd
nM
EC50/IC50
nM
koff
s-1
kon
M-1s-1
pHTemp
°C
Monocarboxylate transporter 1 (MCT1)
(Rattus norvegicus (Rat))
BDBM214700
(US9296728, 23)
Show SMILES OC(=O)c1cc2ccc(cc2oc1=O)N(CC=C)CC=C
Show InChI InChI=1S/C16H15NO4/c1-3-7-17(8-4-2)12-6-5-11-9-13(15(18)19)16(20)21-14(11)10-12/h3-6,9-10H,1-2,7-8H2,(H,18,19)
n/an/a 170n/an/an/an/an/an/a
University of Minnesota
Curated by ChEMBL
Assay Description
Inhibition of MCT1 in rat brain endothelial 4 cells assessed as L-[14C]-Lactate Uptake after 15 mins by scintillation spectrometric analysis
Bioorg Med Chem Lett 26: 3282-3286 (2016)
BindingDB Entry DOI: 10.7270/Q2BP04QP
Monocarboxylate transporter 1 (MCT1)
(Rattus norvegicus (Rat))
BDBM214700
(US9296728, 23)
Show SMILES OC(=O)c1cc2ccc(cc2oc1=O)N(CC=C)CC=C
Show InChI InChI=1S/C16H15NO4/c1-3-7-17(8-4-2)12-6-5-11-9-13(15(18)19)16(20)21-14(11)10-12/h3-6,9-10H,1-2,7-8H2,(H,18,19)
US Patent
n/an/a 250n/an/an/an/a7.4337
Regents of the University of Minnesota
US Patent
Assay Description
The entire lactate uptake studies for the inhibition of MCT1 were carried out on RBE4 (Rat Brain Endothelial 4) cells. The expression of MCT1 on thes...
US Patent US9296728 (2016)
BindingDB Entry DOI: 10.7270/Q2KH0M5R