BDBM215522 US9296745, 78
SMILES: FC(F)(F)c1cnn(c1)C1(CC1)c1nc2ccc(nc2[nH]1)N1CCC[C@H](C1)C(=O)N1CCCC1
InChI Key:
Data: 2 IC50
Activity Spreadsheet -- Enzyme Inhibition Constant Data from BindingDB
Found 2 hits for monomerid = 215522
Trg + Lig
Ki
nM
ΔG°
kcal/mole
IC50
nM
Kd
nM
EC50/IC50
nM
koff
s-1
kon
M-1s-1
pHTemp
°C
Diacylglycerol O-acyltransferase 2
(Homo sapiens (Human))
BDBM215522
(US9296745, 78)
Show SMILES FC(F)(F)c1cnn(c1)C1(CC1)c1nc2ccc(nc2[nH]1)N1CCC[C@H](C1)C(=O)N1CCCC1 |r|
Reactome pathway
US Patent
n/an/a 9.40n/an/an/an/an/an/a
Pfizer Inc.
US Patent
Assay Description
For evaluation of the effects of DGAT2 inhibitors in a cell-based setting, cryopreserved human hepatocytes (Lot QOC, Celsis, Chicago, Ill.) were thaw...
US Patent US9296745 (2016)
BindingDB Entry DOI: 10.7270/Q25719VW
Diacylglycerol O-acyltransferase 2
(Homo sapiens (Human))
BDBM215522
(US9296745, 78)
Show SMILES FC(F)(F)c1cnn(c1)C1(CC1)c1nc2ccc(nc2[nH]1)N1CCC[C@H](C1)C(=O)N1CCCC1 |r|
Reactome pathway
US Patent
n/an/a 83.8n/an/an/an/a7.425
Pfizer Inc.
US Patent
Assay Description
For determination of IC50 values, the reactions were carried out in 384-well white Polyplates (Perkin Elmer) in a total volume of 20 uL. To 1 uL of c...
US Patent US9296745 (2016)
BindingDB Entry DOI: 10.7270/Q25719VW