BDBM215643 US9296745, 212
SMILES: Clc1cnn(c1)C1(CC1)c1nc2ccc(nc2[nH]1)N1CCC[C@H](C1)C(=O)N1CC=CC1
InChI Key:
Data: 1 IC50
Activity Spreadsheet -- Enzyme Inhibition Constant Data from BindingDB
Found 1 hit for monomerid = 215643
Trg + Lig
Ki
nM
ΔG°
kcal/mole
IC50
nM
Kd
nM
EC50/IC50
nM
koff
s-1
kon
M-1s-1
pHTemp
°C
Diacylglycerol O-acyltransferase 2
(Homo sapiens (Human))
BDBM215643
(US9296745, 212)
Show SMILES Clc1cnn(c1)C1(CC1)c1nc2ccc(nc2[nH]1)N1CCC[C@H](C1)C(=O)N1CC=CC1 |r,c:33|
Reactome pathway
US Patent
n/an/a 18.9n/an/an/an/a7.425
Pfizer Inc.
US Patent
Assay Description
For determination of IC50 values, the reactions were carried out in 384-well white Polyplates (Perkin Elmer) in a total volume of 20 uL. To 1 uL of c...
US Patent US9296745 (2016)
BindingDB Entry DOI: 10.7270/Q25719VW