null
SMILES: OC(=O)CN1C(=O)C2(CC(=O)N(Cc3cc(Cl)cc(Cl)c3)C2=O)c2cc(Cl)ccc12
InChI Key: InChIKey=VOCJBWXZCOYCSS-UHFFFAOYSA-N
Activity Spreadsheet -- Enzyme Inhibition Constant Data from BindingDB
Found 1 hit for monomerid = 21580
Trg + Lig
Ki
nM
ΔG°
kcal/mole
IC50
nM
Kd
nM
EC50/IC50
nM
koff
s-1
kon
M-1s-1
pHTemp
°C
Prostaglandin D2 receptor 2
(Homo sapiens (Human))
BDBM21580
(2-{5-chloro-1'-[(3,5-dichlorophenyl)methyl]-1,2-di...)
Show SMILES OC(=O)CN1C(=O)C2(CC(=O)N(Cc3cc(Cl)cc(Cl)c3)C2=O)c2cc(Cl)ccc12
Show InChI InChI=1S/C20H13Cl3N2O5/c21-11-1-2-15-14(6-11)20(18(29)24(15)9-17(27)28)7-16(26)25(19(20)30)8-10-3-12(22)5-13(23)4-10/h1-6H,7-9H2,(H,27,28)
Reactome pathway
36n/an/an/a 82n/an/an/an/a
Merck Serono
Assay Description
A scintillation proximity assay was used for radioligand competition and saturation binding assays. Nonspecific binding was determined in the presenc...
J Med Chem 51: 2227-2243 (2008)
Article DOI: 10.1021/jm701383e
BindingDB Entry DOI: 10.7270/Q22R3PZS