BDBM21649 (2S)-3-(1H-indol-3-yl)-2-[(2R,3R)-3-(4-phenylphenyl)-2-(sulfanylmethyl)butanamido]propanoic acid::Mercaptoacyl amino acid compound, 10b
SMILES: C[C@H]([C@@H](CS)C(=O)N[C@@H](Cc1c[nH]c2ccccc12)C(O)=O)c1ccc(cc1)-c1ccccc1
InChI Key: InChIKey=CKIOTOMZKGPZHH-FODJJAHYSA-N
Data: 3 KI
Activity Spreadsheet -- Enzyme Inhibition Constant Data from BindingDB
Found 3 hits for monomerid = 21649
Trg + Lig
Ki
nM
ΔG°
kcal/mole
IC50
nM
Kd
nM
EC50/IC50
nM
koff
s-1
kon
M-1s-1
pHTemp
°C
Neprilysin
(Oryctolagus cuniculus (rabbit))
BDBM21649
((2S)-3-(1H-indol-3-yl)-2-[(2R,3R)-3-(4-phenylpheny...)
Show SMILES C[C@H]([C@@H](CS)C(=O)N[C@@H](Cc1c[nH]c2ccccc12)C(O)=O)c1ccc(cc1)-c1ccccc1 |r|
Show InChI InChI=1S/C28H28N2O3S/c1-18(19-11-13-21(14-12-19)20-7-3-2-4-8-20)24(17-34)27(31)30-26(28(32)33)15-22-16-29-25-10-6-5-9-23(22)25/h2-14,16,18,24,26,29,34H,15,17H2,1H3,(H,30,31)(H,32,33)/t18-,24+,26-/m0/s1
1.5 -12.5n/an/an/an/an/a7.437
CNRS
Assay Description
NEP was preincubated in black 96-well microplates with or without increasing concentrations of inhibitors. DGPA was added, and the reaction was stopp...
J Med Chem 45: 1477-86 (2002)
Article DOI: 10.1021/jm0005454
BindingDB Entry DOI: 10.7270/Q2T72FQ1
Angiotensin-Converting Enzyme
(Rattus norvegicus)
BDBM21649
((2S)-3-(1H-indol-3-yl)-2-[(2R,3R)-3-(4-phenylpheny...)
Show SMILES C[C@H]([C@@H](CS)C(=O)N[C@@H](Cc1c[nH]c2ccccc12)C(O)=O)c1ccc(cc1)-c1ccccc1 |r|
Show InChI InChI=1S/C28H28N2O3S/c1-18(19-11-13-21(14-12-19)20-7-3-2-4-8-20)24(17-34)27(31)30-26(28(32)33)15-22-16-29-25-10-6-5-9-23(22)25/h2-14,16,18,24,26,29,34H,15,17H2,1H3,(H,30,31)(H,32,33)/t18-,24+,26-/m0/s1
130n/an/an/an/an/an/an/an/a
CNRS
Assay Description
Specific activity of ACE was assayed in black 96-well microplates with or without various concentrations of inhibitors. N-Cbz-Phe-His-Leu was added, ...
J Med Chem 45: 1477-86 (2002)
Article DOI: 10.1021/jm0005454
BindingDB Entry DOI: 10.7270/Q2T72FQ1
Endothelin-converting enzyme 1 (ECE1)
(Homo sapiens (Human))
BDBM21649
((2S)-3-(1H-indol-3-yl)-2-[(2R,3R)-3-(4-phenylpheny...)
Show SMILES C[C@H]([C@@H](CS)C(=O)N[C@@H](Cc1c[nH]c2ccccc12)C(O)=O)c1ccc(cc1)-c1ccccc1 |r|
Show InChI InChI=1S/C28H28N2O3S/c1-18(19-11-13-21(14-12-19)20-7-3-2-4-8-20)24(17-34)27(31)30-26(28(32)33)15-22-16-29-25-10-6-5-9-23(22)25/h2-14,16,18,24,26,29,34H,15,17H2,1H3,(H,30,31)(H,32,33)/t18-,24+,26-/m0/s1
135n/an/an/an/an/an/an/an/a
CNRS
Assay Description
ECE activity was performed in black 96-well microplates with recombinant human ECE-1c (hECE-1c). The hECE-1c was preincubated with or without increa...
J Med Chem 45: 1477-86 (2002)
Article DOI: 10.1021/jm0005454
BindingDB Entry DOI: 10.7270/Q2T72FQ1