BDBM21655 (2S)-2-[(2R)-2-[(1S)-2,3-dihydro-1H-inden-1-yl]-3-sulfanylpropanamido]-3-(1H-indol-3-yl)propanoic acid::Mercaptoacyl amino acid compound, 13d
SMILES: OC(=O)[C@H](Cc1c[nH]c2ccccc12)NC(=O)[C@H](CS)[C@@H]1CCc2ccccc12
InChI Key: InChIKey=AXECOZSOSVNVEZ-SBHAEUEKSA-N
Data: 3 KI
Activity Spreadsheet -- Enzyme Inhibition Constant Data from BindingDB
Found 3 hits for monomerid = 21655
Trg + Lig
Ki
nM
ΔG°
kcal/mole
IC50
nM
Kd
nM
EC50/IC50
nM
koff
s-1
kon
M-1s-1
pHTemp
°C
Neprilysin
(Oryctolagus cuniculus (rabbit))
BDBM21655
((2S)-2-[(2R)-2-[(1S)-2,3-dihydro-1H-inden-1-yl]-3-...)
Show SMILES OC(=O)[C@H](Cc1c[nH]c2ccccc12)NC(=O)[C@H](CS)[C@@H]1CCc2ccccc12 |r|
Show InChI InChI=1S/C23H24N2O3S/c26-22(19(13-29)18-10-9-14-5-1-2-6-16(14)18)25-21(23(27)28)11-15-12-24-20-8-4-3-7-17(15)20/h1-8,12,18-19,21,24,29H,9-11,13H2,(H,25,26)(H,27,28)/t18-,19-,21+/m1/s1
27 -10.7n/an/an/an/an/a7.437
CNRS
Assay Description
NEP was preincubated in black 96-well microplates with or without increasing concentrations of inhibitors. DGPA was added, and the reaction was stopp...
J Med Chem 45: 1477-86 (2002)
Article DOI: 10.1021/jm0005454
BindingDB Entry DOI: 10.7270/Q2T72FQ1
Angiotensin-Converting Enzyme
(Rattus norvegicus)
BDBM21655
((2S)-2-[(2R)-2-[(1S)-2,3-dihydro-1H-inden-1-yl]-3-...)
Show SMILES OC(=O)[C@H](Cc1c[nH]c2ccccc12)NC(=O)[C@H](CS)[C@@H]1CCc2ccccc12 |r|
Show InChI InChI=1S/C23H24N2O3S/c26-22(19(13-29)18-10-9-14-5-1-2-6-16(14)18)25-21(23(27)28)11-15-12-24-20-8-4-3-7-17(15)20/h1-8,12,18-19,21,24,29H,9-11,13H2,(H,25,26)(H,27,28)/t18-,19-,21+/m1/s1
170n/an/an/an/an/an/an/an/a
CNRS
Assay Description
Specific activity of ACE was assayed in black 96-well microplates with or without various concentrations of inhibitors. N-Cbz-Phe-His-Leu was added, ...
J Med Chem 45: 1477-86 (2002)
Article DOI: 10.1021/jm0005454
BindingDB Entry DOI: 10.7270/Q2T72FQ1
Endothelin-converting enzyme 1 (ECE1)
(Homo sapiens (Human))
BDBM21655
((2S)-2-[(2R)-2-[(1S)-2,3-dihydro-1H-inden-1-yl]-3-...)
Show SMILES OC(=O)[C@H](Cc1c[nH]c2ccccc12)NC(=O)[C@H](CS)[C@@H]1CCc2ccccc12 |r|
Show InChI InChI=1S/C23H24N2O3S/c26-22(19(13-29)18-10-9-14-5-1-2-6-16(14)18)25-21(23(27)28)11-15-12-24-20-8-4-3-7-17(15)20/h1-8,12,18-19,21,24,29H,9-11,13H2,(H,25,26)(H,27,28)/t18-,19-,21+/m1/s1
680n/an/an/an/an/an/an/an/a
CNRS
Assay Description
ECE activity was performed in black 96-well microplates with recombinant human ECE-1c (hECE-1c). The hECE-1c was preincubated with or without increa...
J Med Chem 45: 1477-86 (2002)
Article DOI: 10.1021/jm0005454
BindingDB Entry DOI: 10.7270/Q2T72FQ1